program: Gaussian 09
title: 000039549
version: EM64L-G09RevD.01
frameworkgroup: C1[X(C18H29NO)]
method: RPBEPBE
basis: SDD
operation: Freq
keyword: #p
keyword: freq=noraman
keyword: PBEPBE/SDD
title: #p freq=noraman PBEPBE/SDD
converged: YES YES NO NO
title: Mulliken charges:
elementType: O N C C C C C C C C C C C C C C C C C C H H H H H H H H H H H H H H H H H H H H H H H H H H H H H
charge: -0.469137 -0.078440 0.260693 0.351441 -0.202543 0.290150 -0.566303 -0.559964 -0.481414 -0.822033 -0.797038 -0.781968 -0.596590 -0.044197 -0.049133 -0.437055 -0.379009 -0.352111 -0.435488 -0.444135 0.240147 0.241664 0.210893 0.220425 0.237307 0.229915 0.201230 0.260967 0.202772 0.205671 0.213163 0.214171 0.231231 0.194507 0.281437 0.205725 0.257095 0.243831 0.341561 0.215338 0.242028 0.230128 0.178126 0.176851 0.241885 0.230213 0.210416 0.205825 0.229751
chargesum: 0.00000
title: Mulliken charges with hydrogens summed into heavy atoms:
elementType: O N C C C C C C C C C C C C C C C C C C
charge: -0.127576 -0.078440 0.260693 0.351441 0.037605 0.290150 -0.113745 -0.102232 -0.050269 -0.152623 -0.138474 -0.100299 -0.095663 -0.044197 -0.049133 0.020310 0.029245 0.066625 0.005141 -0.008558
polarizability: 2.48957883e+02 -1.98133963e+00 1.79455327e+02 -3.93120827e+00 -6.60888049e-01 1.64430240e+02
1716.lowfreq: -10.2039 -0.0005 -0.0004 0.0009 2.1676 6.1371 15.2543 22.2490 31.4998
frequency: 10.1224 20.8526 31.3947 53.1325 75.3468 87.7732 114.0273 160.5633 175.5503 192.7186 196.7550 214.4469 220.9807 235.2731 248.3583 262.8429 285.1322 296.4351 314.9578 319.8578 347.6420 351.7134 370.1787 390.5394 392.8408 411.0584 426.5454 430.5272 464.2082 500.9530 524.3493 578.5762 598.0866 611.6925 636.3861 650.8268 700.3362 732.9816 754.2620 783.4268 818.7047 841.4133 846.3996 852.8427 861.2099 877.5127 895.6335 898.0217 915.5689 941.8211 944.5865 948.7484 954.5527 964.1595 972.0999 980.5416 993.6761 997.3177 1026.9197 1053.6142 1058.9511 1065.6109 1087.5557 1092.9981 1112.5602 1116.9806 1129.0681 1143.0372 1154.2372 1164.4024 1179.4697 1185.7938 1189.8865 1190.9392 1203.7959 1213.3679 1222.0805 1223.0315 1226.9222 1230.7455 1240.3353 1255.3986 1265.8857 1266.6263 1283.9302 1288.6469 1291.8315 1295.5168 1307.0763 1315.0158 1338.7220 1346.3735 1371.4680 1380.4973 1387.3666 1400.7338 1439.3846 1453.8548 1457.6846 1461.7181 1465.2771 1468.1656 1470.6325 1478.7387 1480.4167 1480.8028 1486.1611 1489.8978 1494.2215 1504.9182 1508.3021 2274.2722 2812.1356 2831.7609 2847.1711 2972.2901 2975.9906 2978.9470 2982.5496 2997.3032 2998.9429 3002.5078 3013.8562 3018.4062 3025.6723 3035.1158 3042.1817 3043.6918 3049.6422 3050.7387 3052.0598 3053.0209 3059.4541 3065.6394 3069.9523 3072.7189 3088.9158 3094.8963 3096.1053 3120.7522 3470.0106
redmass: 3.2196 3.9489 3.0945 2.1633 3.0478 2.8352 2.4883 2.8654 1.3180 1.3283 2.4618 1.9695 1.7198 1.6373 2.4803 2.7522 3.0605 3.3395 2.4616 2.1011 3.2831 2.7880 4.1298 2.7327 2.3264 1.8257 1.5373 2.5428 3.4206 2.3978 3.4265 3.8179 3.5788 3.0878 3.2043 3.1754 3.9620 2.7618 1.4840 2.9632 1.5230 1.9070 2.5548 2.5815 2.0278 2.2552 2.5662 1.9779 1.9763 1.6072 1.9029 1.6817 1.7817 2.1267 1.6444 1.6781 1.7236 1.6467 1.6353 2.0082 2.4802 1.7322 1.4891 1.5897 2.2299 2.0239 2.9835 2.3013 2.1321 2.6537 1.8709 1.2318 1.3540 1.6354 1.9068 1.8427 1.6005 1.2369 1.5844 1.3370 1.9574 1.3209 2.0335 1.4617 1.1986 1.7618 1.3313 1.4678 1.8526 1.3477 1.4651 1.7698 1.4999 1.1985 1.2259 1.1919 1.0846 1.0796 1.0672 1.0600 1.0820 1.0537 1.0617 1.0843 1.0808 1.0606 1.0561 1.0695 1.1048 1.0577 1.0771 11.7081 1.0710 1.0716 1.0707 1.0393 1.0376 1.0377 1.0590 1.0603 1.0845 1.0620 1.0597 1.0641 1.0674 1.0839 1.0957 1.0973 1.0980 1.0981 1.0883 1.0974 1.0975 1.1022 1.1047 1.1019 1.0968 1.1054 1.0975 1.0954 1.0653
irintensity: 0.0911 0.2120 0.3764 0.0333 0.6525 0.4181 0.3994 0.8078 0.9402 0.4377 0.6857 0.1074 5.7435 3.5197 1.0146 1.7852 1.5228 4.5102 1.0344 7.2463 0.9421 2.7935 2.3086 2.2019 9.0740 37.4145 53.1462 10.1405 2.2499 4.5583 1.0493 2.3306 4.0672 2.4235 0.9631 2.3261 6.1267 1.3491 1.0865 2.9878 4.6282 8.5563 1.7747 4.7225 13.2463 7.5474 6.6225 1.1864 1.4295 3.1606 7.0860 2.4031 4.1780 31.4927 0.8118 0.7678 0.8767 1.1240 3.9235 17.4760 7.3343 21.0235 0.7373 2.8901 41.6897 12.0812 10.4173 16.4196 6.0163 13.1521 1.4970 2.5924 2.5396 4.3847 9.0941 14.2650 6.9445 2.7409 10.5634 2.5292 0.0762 13.3155 1.4710 7.7863 5.1457 3.7028 10.6897 6.6076 6.4381 18.5290 11.5740 32.3895 20.3165 11.0016 18.6570 39.2611 6.3219 3.5862 4.2434 0.4571 1.7104 7.0408 15.5633 10.8818 4.6962 13.9082 4.9654 5.2857 1.7650 6.1924 21.8378 4.3308 55.3944 67.3420 204.2955 29.9340 32.5788 70.4540 22.0847 39.2035 18.8977 34.5918 21.5064 51.2667 58.0406 63.6992 28.9929 2.2294 20.1932 22.6141 18.3236 49.3779 50.5156 10.1393 2.3675 99.3075 31.2504 71.5470 18.7684 5.8715 36.4126
temp: 298.150 k
press: 1.00000 atm
elementType: 8 7 6 6 6 6 6 6 6 6 6 6 6 6 6 6 6 6 6 6 1 1 1 1 1 1 1 1 1 1 1 1 1 1 1 1 1 1 1 1 1 1 1 1 1 1 1 1 1
symmnumber: 1
zpe: 1132401.4 jmol-1
zpe.correction: 0.431309 hartree
zpe.thermalcorrener: 0.452514 hartree
zpe.thermalcorrenthalpy: 0.453458 hartree
zpe.thermalcorrgfe: 0.380096 hartree
zpe.sumelectzpe: -831.626565 hartree
zpe.sumelectthermal: -831.605360 hartree
zpe.sumelectthermalent: -831.604415 hartree
zpe.sumelectthermalfe: -831.677778 hartree
dipole: 1.6915 -0.2246 1.9909
dipole: 2.6221
quadrupole: -109.0684 -121.9072 -127.0766
quadrupole: 0.6626 -1.2231 0.7707
quadrupole: 10.2823 -2.5565 -7.7258 0.6626 -1.2231 0.7707
hfenergy: -832.0578738 hartree
pointgroup: C01 [X(C18H29N1O1)]
dipole: -0.6590383 0.1425017 0.7807397 debye
polarizability: 249.0565918|-1.0210213|179.4419407|3.2268617|-0.458977|164.3449166 unknown
InChI: InChI=1S/C18H29NO/c1-16(2)15-8-10-17(16,3)18(20,14-15)9-4-5-11-19-12-6-7-13-19/h15,20H,6-14H2,1-3H3
charge 0 multiplicity 1
49 atoms
O  0.677565 0.077066 -1.554505
N  -3.923619 0.176635 -0.228197
C  2.865871 0.461847 -0.462978
C  3.256098 -1.064515 -0.200888
C  2.533881 -1.09738 1.193672
C  1.295348 0.449863 -0.263865
C  1.08512 -0.660651 0.833655
C  3.481165 1.126803 0.815008
C  3.197446 0.08991 1.960252
C  3.327193 1.088152 -1.781183
C  4.784146 -1.320173 -0.115528
C  2.702253 -2.082771 -1.229251
C  0.688295 1.83291 0.156749
C  -0.785149 1.803138 0.110299
C  -2.013414 1.699092 0.031223
C  -3.481705 1.580028 -0.05937
C  -5.384961 0.036078 -0.46675
C  -3.633859 -0.719669 0.921388
C  -5.645887 -1.484209 -0.280395
C  -4.433408 -1.997957 0.571688
H  2.586791 -2.063054 1.725792
H  0.508165 -1.497117 0.402385
H  0.532342 -0.286071 1.714699
H  3.066382 2.127826 1.02107
H  4.565286 1.270947 0.660883
H  4.12812 -0.218534 2.4686
H  2.521318 0.492132 2.737519
H  2.8503 0.588987 -2.640508
H  3.063931 2.162171 -1.83351
H  4.426108 1.014217 -1.885949
H  4.968248 -2.39072 0.095602
H  5.268024 -1.091093 -1.083786
H  5.300058 -0.737384 0.66499
H  2.850584 -3.113872 -0.853006
H  1.639055 -1.927304 -1.458987
H  3.255498 -1.996327 -2.183909
H  1.063283 2.614794 -0.53291
H  1.016713 2.100351 1.177248
H  -0.302414 0.234011 -1.471906
H  -3.94123 2.052473 0.850378
H  -3.841984 2.15863 -0.932712
H  -5.650384 0.403301 -1.474355
H  -5.980981 0.621669 0.281208
H  -4.000514 -0.278852 1.885321
H  -2.548066 -0.89043 1.018207
H  -5.676344 -1.99912 -1.255289
H  -6.612741 -1.661025 0.222202
H  -4.752341 -2.538562 1.479635
H  -3.808586 -2.681041 -0.028133
