program: Gaussian 09
title: 000005604
version: EM64L-G09RevD.01
frameworkgroup: C1[X(C11H14N4O4)]
method: RPBEPBE
basis: SDD
operation: Freq
keyword: #p
keyword: freq=noraman
keyword: PBEPBE/SDD
title: #p freq=noraman PBEPBE/SDD
converged: YES YES NO NO
title: Mulliken charges:
elementType: O O O O N N N N C C C C C C C C C C C H H H H H H H H H H H H H H
charge: -0.262209 -0.442541 -0.476693 -0.501470 -0.161734 -0.056949 -0.084799 -0.627516 -0.086223 -0.173972 -0.177807 0.005066 -0.403442 0.119665 -0.208608 0.119082 -0.419006 0.133386 -0.373556 0.300381 0.265457 0.241620 0.236702 0.245806 0.233166 0.322897 0.344784 0.383836 0.242407 0.373394 0.239152 0.319810 0.329914
chargesum: 0.00000
title: Mulliken charges with hydrogens summed into heavy atoms:
elementType: O O O O N N N N C C C C C C C C C C C
charge: -0.262209 -0.097757 -0.092857 -0.128076 -0.161734 -0.056949 -0.084799 0.022207 0.214157 0.091485 0.063813 0.241768 0.075531 0.119665 0.114290 0.119082 -0.176599 0.133386 -0.134405
polarizability: 2.22954288e+02 2.27725365e+00 1.54021393e+02 -6.58137672e+00 1.56779368e+01 1.05276868e+02
1716.lowfreq: -10.8119 -6.6103 -0.0002 0.0003 0.0004 5.7462 16.1935 37.8929 60.5119
frequency: 15.6276 37.8535 60.4737 86.9450 114.7138 132.2227 149.1403 189.0631 210.9730 219.0549 261.4392 267.8460 277.1803 294.7980 309.1368 319.4423 352.0200 382.1356 389.9543 427.5432 455.3486 508.7099 520.9202 539.9689 557.5142 567.4906 615.9014 624.2774 668.8038 680.5970 701.1869 722.1800 729.2402 751.3031 795.7047 803.5382 813.2412 857.7959 869.1694 903.6884 921.2352 923.0866 942.4142 954.7472 960.7592 989.0347 1007.8764 1017.6833 1040.2204 1053.9473 1074.7733 1097.6086 1158.3083 1173.5921 1180.8668 1188.4077 1197.5544 1224.8893 1250.3175 1261.8903 1272.2061 1278.9042 1297.4716 1306.6266 1320.7673 1339.4882 1340.9038 1351.9304 1363.7530 1382.1633 1408.9681 1414.9591 1427.3754 1442.2744 1475.9734 1496.5078 1540.8581 1578.0158 1620.6885 2995.0841 3001.7475 3019.0894 3031.9998 3071.4560 3073.2103 3163.0134 3192.3465 3216.5209 3373.7480 3550.0015 3570.2130 3600.0086 3708.3325
redmass: 5.1923 5.6693 6.0241 4.4925 5.8230 3.7282 4.5936 5.8270 6.2566 5.0369 5.1248 3.4592 4.1413 1.5071 2.7482 1.3974 3.7789 3.3389 1.2913 4.4801 5.8204 6.7880 1.1380 4.1258 3.9763 3.9939 6.7613 4.7018 8.3529 7.1181 1.7216 1.8067 4.3278 1.4044 5.4403 5.8738 4.0783 7.7042 4.7243 1.2875 1.4498 2.9443 3.8878 2.6375 2.8936 3.5290 2.7777 4.3411 2.7634 1.6434 2.6003 1.9102 2.0059 1.2164 1.2261 1.5722 1.5632 1.2431 1.8916 1.6081 1.5159 1.5259 1.4889 1.3371 5.4915 1.7108 1.7330 2.1345 1.8283 1.7313 1.6173 1.5390 2.9511 3.3591 1.0769 4.7267 6.2865 2.9630 1.7791 1.0851 1.0561 1.0873 1.0873 1.0888 1.1071 1.0920 1.0927 1.1062 1.0651 1.0449 1.0664 1.0669 1.1043
irintensity: 2.8724 0.8865 3.5871 5.8309 2.2970 7.3632 1.7516 5.4469 2.2535 16.5920 22.1267 20.3724 13.0711 69.9010 51.4071 124.7204 24.5075 9.8719 194.5002 6.7099 20.4342 3.3879 71.9564 7.2172 1.7655 3.6526 1.9593 15.2650 1.4492 19.4114 44.4005 69.9845 7.2404 155.0189 71.6870 5.6459 52.1186 12.8741 48.6376 7.6634 16.3486 60.2907 16.4074 23.0163 96.7617 69.1789 25.1050 171.6209 6.4327 23.0530 4.9344 27.2988 1.7239 42.7410 27.0728 21.1062 24.4327 10.2586 89.6349 74.0385 18.8877 17.0635 25.9170 10.6176 12.2344 12.8872 4.8831 134.3704 32.3561 15.9224 4.0671 41.1722 54.6855 21.2542 9.4396 77.6112 56.0574 99.8388 496.9348 21.9644 30.2799 66.7897 18.4126 10.2463 46.9275 21.4222 45.9512 17.5520 161.9712 97.4973 8.9741 10.8364 31.2324
temp: 298.150 k
press: 1.00000 atm
elementType: 8 8 8 8 7 7 7 7 6 6 6 6 6 6 6 6 6 6 6 1 1 1 1 1 1 1 1 1 1 1 1 1 1
symmnumber: 1
zpe: 670088.0 jmol-1
zpe.correction: 0.255223 hartree
zpe.thermalcorrener: 0.272330 hartree
zpe.thermalcorrenthalpy: 0.273274 hartree
zpe.thermalcorrgfe: 0.209574 hartree
zpe.sumelectzpe: -946.031562 hartree
zpe.sumelectthermal: -946.014456 hartree
zpe.sumelectthermalent: -946.013511 hartree
zpe.sumelectthermalfe: -946.077211 hartree
dipole: 4.4408 -4.9648 -1.2975
dipole: 6.7863
quadrupole: -89.0439 -101.4693 -109.5917
quadrupole: 7.7561 8.7035 -7.4845
quadrupole: 10.9911 -1.4343 -9.5567 7.7561 8.7035 -7.4845
hfenergy: -946.2867853 hartree
pointgroup: C01 [X(C11H14N4O4)]
dipole: -1.7775751 1.8578232 -0.7192128 debye
polarizability: 221.5650457|6.1315339|152.3475372|13.3206918|-17.8123032|108.3399657 unknown
InChI: InChI=1S/C11H14N4O4/c12-9-5-1-2-15(10(5)14-4-13-9)11-8(18)7(17)6(3-16)19-11/h1-2,4,6-8,11,16-18H,3,12H2
charge 0 multiplicity 1
33 atoms
O  -1.714474 -0.521881 1.172624
O  -2.135767 -2.701046 -1.074679
O  -2.900055 0.888755 -1.516359
O  -4.700145 1.495077 0.389129
N  0.23059 -0.0959 -0.207962
N  2.016203 -1.434963 0.828858
N  4.21409 -0.351235 0.797667
N  4.606888 1.765074 -0.126699
C  -0.861588 -1.023164 0.066467
C  -1.811605 -1.269294 -1.132079
C  -3.069022 -0.408885 -0.856007
C  -3.101478 -0.30785 0.694875
C  -3.541462 1.069011 1.218876
C  1.551646 -0.316799 0.200427
C  0.160016 1.170931 -0.823655
C  2.32298 0.82781 -0.175116
C  1.423483 1.758783 -0.8216
C  3.711919 0.756965 0.16064
C  3.35097 -1.373051 1.092156
H  -0.396327 -1.966872 0.397124
H  -1.351544 -0.988054 -2.0974
H  -3.983498 -0.907136 -1.2336
H  -3.737768 -1.115046 1.103834
H  -2.701049 1.778399 1.102385
H  -3.828965 1.005141 2.283763
H  -0.792884 1.525056 -1.217272
H  -2.677548 -2.945286 -1.866788
H  -3.668793 1.447896 -1.199896
H  1.656006 2.735909 -1.242943
H  -5.160556 2.260483 0.811484
H  3.789966 -2.238507 1.597173
H  4.317497 2.617873 -0.595584
H  5.578274 1.632706 0.147457
