program: Gaussian 09
title: 000039467
version: EM64L-G09RevD.01
frameworkgroup: C1[X(C18H22N2O)]
method: RPBEPBE
basis: SDD
operation: Freq
keyword: #p
keyword: freq=noraman
keyword: PBEPBE/SDD
title: #p freq=noraman PBEPBE/SDD
converged: YES YES NO NO
title: Mulliken charges:
elementType: O N N C C C C C C C C C C C C C C C C C C H H H H H H H H H H H H H H H H H H H H H H
charge: -0.287579 -0.078973 -0.615458 0.027014 -0.459784 0.347967 0.265503 -0.417780 0.173455 -0.396033 -0.352621 -0.358852 -0.388771 -0.621807 -0.623296 -0.242047 -0.241718 -0.254689 -0.250159 -0.249125 -0.245950 0.218445 0.225022 0.201518 0.279221 0.276987 0.264843 0.240842 0.258807 0.214858 0.185878 0.234453 0.222266 0.187245 0.217762 0.351818 0.327671 0.223932 0.230126 0.223657 0.228245 0.226267 0.230838
chargesum: 0.00000
title: Mulliken charges with hydrogens summed into heavy atoms:
elementType: O N N C C C C C C C C C C C C C C C C C C
charge: -0.287579 -0.078973 0.064031 0.027014 -0.016317 0.347967 0.265503 0.062960 0.173455 -0.119046 -0.087778 -0.118010 -0.129964 0.013383 0.003978 -0.018115 -0.011592 -0.031032 -0.021913 -0.022859 -0.015112
polarizability: 2.19116933e+02 1.71400798e+01 2.16864044e+02 1.51180179e+01 8.02288139e+00 1.76444777e+02
1716.lowfreq: -11.6145 -5.4348 -0.0006 -0.0005 -0.0005 5.2735 13.5065 23.5044 37.0815
frequency: -6.5457 22.3915 36.9883 46.8635 53.8786 68.5903 78.2458 102.1184 150.8762 166.8540 200.3312 220.4417 224.7390 240.1291 252.5152 256.5387 270.7748 305.0964 326.2442 351.1605 366.5529 401.3183 405.2105 407.9943 438.0858 483.4883 517.2321 538.5771 549.7288 583.1705 615.7387 617.7369 628.9420 639.9524 683.7404 704.3084 709.4149 740.1695 763.4042 770.5780 798.3804 814.4506 855.4508 859.9999 889.5493 900.2360 933.2414 939.2666 979.2392 984.4132 989.6763 991.4398 995.4100 998.2343 1007.7409 1024.4590 1031.0589 1032.7122 1034.0971 1061.3950 1065.3871 1079.5210 1088.7363 1091.3457 1099.4537 1135.6916 1161.4252 1172.8464 1173.2681 1190.2734 1196.4805 1199.7986 1201.5422 1251.0001 1264.3718 1298.0844 1311.9961 1322.1972 1326.3459 1328.0680 1369.3733 1376.4033 1382.8972 1416.8518 1431.5048 1434.6119 1441.1153 1459.2865 1463.3292 1470.9436 1476.5896 1481.2811 1482.9722 1483.5697 1491.0252 1562.4007 1583.4439 1588.6868 1606.1001 1610.2029 1621.8594 2841.8842 2854.0791 2880.0067 2981.0437 3016.6703 3021.5669 3041.6431 3067.8764 3076.9586 3080.1489 3117.2838 3124.4555 3126.8433 3132.3148 3139.6351 3145.1681 3157.2524 3158.3731 3169.8032 3174.7598 3508.5891 3663.4528
redmass: 2.6317 4.1163 3.9056 3.7397 3.9949 4.2528 4.4663 3.6715 2.9139 5.5037 2.7204 1.9159 1.6029 1.8575 1.7587 4.3759 3.0557 4.8896 5.3320 2.4360 3.9385 2.8337 2.8688 3.1316 2.3486 3.2575 3.3055 1.5228 1.7270 3.0405 5.6727 6.2450 1.5838 5.2106 4.4365 1.7010 1.7080 4.0315 1.8634 2.0658 1.5318 4.2223 1.2506 1.2535 2.0322 3.0958 1.6896 1.6241 1.4737 1.4103 5.3823 3.7244 1.4782 1.3462 4.4897 2.5270 1.7837 2.2535 1.8860 1.9691 1.8940 1.9064 1.4840 1.6086 1.9334 1.5102 2.1942 1.0539 1.0546 2.5828 2.4863 1.2604 1.1292 1.9224 2.1884 1.5618 1.2905 1.4246 1.5353 1.9257 4.3470 7.3952 1.4436 1.1450 2.2448 2.2460 1.1757 1.0496 1.0813 1.0856 1.0685 1.8161 1.1139 2.1024 1.0897 1.7334 5.7688 5.9985 5.6753 5.5954 2.7678 1.0571 1.0584 1.0689 1.0587 1.0725 1.0716 1.0983 1.0942 1.0995 1.1001 1.0850 1.0848 1.0878 1.0882 1.0939 1.0936 1.0987 1.0960 1.0983 1.0956 1.0444 1.1044
irintensity: 0.5183 4.4659 0.1720 0.7989 1.3033 2.9978 0.9524 0.3522 2.5060 2.7290 0.4809 2.1221 1.9170 0.4443 1.6014 2.4262 1.0357 0.6981 0.9663 11.1227 11.7874 0.3204 0.2095 0.7940 1.0661 0.7046 3.7567 57.2971 55.0219 30.3887 0.8403 0.7655 81.3885 15.9392 3.9371 55.7121 60.8987 8.2655 15.8349 44.1345 12.3420 17.5680 0.2357 0.3203 1.1794 5.1735 2.0484 0.8379 0.3027 0.0103 0.6410 0.3593 0.7750 0.0768 4.7569 30.0929 21.9573 21.3662 11.7293 6.1139 2.5244 16.6301 4.8682 8.1399 15.7087 6.2764 5.5262 0.1197 0.0880 4.7624 9.3771 8.6615 2.2907 2.7458 6.9608 18.6327 53.8043 6.2753 29.8770 60.6728 0.5289 1.0080 1.6919 1.9719 11.1086 8.8970 2.2162 16.4279 8.2833 12.2859 11.0946 45.0189 6.1486 17.6416 12.9973 114.6855 2.8801 0.6462 47.0187 8.3870 213.5190 66.3467 140.5416 113.0894 18.1647 41.4068 58.5905 18.1883 4.5958 36.3924 52.8874 4.3000 1.2925 4.2439 3.6265 33.2924 22.4055 26.3514 30.9353 13.6787 10.1729 32.7745 52.1204
temp: 298.150 k
press: 1.00000 atm
elementType: 8 7 7 6 6 6 6 6 6 6 6 6 6 6 6 6 6 6 6 6 6 1 1 1 1 1 1 1 1 1 1 1 1 1 1 1 1 1 1 1 1 1 1
symmnumber: 1
zpe: 943450.8 jmol-1
zpe.correction: 0.359341 hartree
zpe.thermalcorrener: 0.378970 hartree
zpe.thermalcorrenthalpy: 0.379914 hartree
zpe.thermalcorrgfe: 0.310457 hartree
zpe.sumelectzpe: -882.289042 hartree
zpe.sumelectthermal: -882.269413 hartree
zpe.sumelectthermalent: -882.268469 hartree
zpe.sumelectthermalfe: -882.337926 hartree
dipole: -2.9791 -0.6542 -1.2568
dipole: 3.2989
quadrupole: -116.8069 -119.0799 -123.0500
quadrupole: 5.4861 -6.7755 -0.6067
quadrupole: 2.8387 0.5657 -3.4044 5.4861 -6.7755 -0.6067
hfenergy: -882.6483834 hartree
pointgroup: C01 [X(C18H22N2O1)]
dipole: 1.1367129 0.3362968 -0.5284794 debye
polarizability: 215.7293831|16.494339|219.0744744|-15.7275689|-10.6592836|177.621897 unknown
InChI: InChI=1S/C18H22N2O/c1-20(2)14-13-18(17(19)21,15-9-5-3-6-10-15)16-11-7-4-8-12-16/h3-12H,13-14,19H2,1-2H3
charge 0 multiplicity 1
43 atoms
O  -0.921241 0.268446 2.69928
N  -3.550393 1.495392 -0.423332
N  1.074954 1.397032 2.511499
C  0.118588 0.349983 0.433678
C  -1.085766 1.138157 -0.21722
C  -0.044582 -1.163481 0.118124
C  1.471849 0.844321 -0.145237
C  -2.493195 0.586153 0.09268
C  0.051077 0.644278 1.973165
C  -0.317908 -2.15646 1.090824
C  2.636799 0.041757 0.012212
C  0.0785 -1.56839 -1.239485
C  1.616407 2.105412 -0.781775
C  -4.85297 1.242998 0.227786
C  -3.671791 1.472503 -1.895485
C  -0.456449 -3.514262 0.715687
C  3.894436 0.477451 -0.455495
C  -0.067862 -2.918993 -1.615525
C  2.875561 2.543559 -1.255687
C  -0.335656 -3.904114 -0.635632
C  4.021192 1.733834 -1.094796
H  -0.916028 1.139996 -1.311313
H  -1.070709 2.192201 0.119183
H  -2.599991 -0.445335 -0.325427
H  -2.607324 0.50661 1.186542
H  -0.450558 -1.870962 2.137281
H  2.548214 -0.939237 0.492348
H  0.30656 -0.819656 -2.00762
H  0.747928 2.756353 -0.916895
H  -5.591433 1.990999 -0.114744
H  -5.268933 0.225308 0.012547
H  -4.745259 1.342356 1.322055
H  -2.722575 1.779794 -2.367494
H  -3.945834 0.462522 -2.297724
H  -4.450133 2.189725 -2.213127
H  1.876966 1.694342 1.957947
H  1.014924 1.640324 3.500348
H  -0.666753 -4.265139 1.48604
H  4.773715 -0.163385 -0.324794
H  0.031319 -3.203598 -2.669352
H  2.957871 3.518651 -1.749235
H  -0.446898 -4.955805 -0.922797
H  4.995784 2.072259 -1.463634
