program: Gaussian 09
title: 000039437
version: EM64L-G09RevD.01
frameworkgroup: C1[X(C8H10IN3)]
method: RPBEPBE
basis: SDD
operation: Freq
keyword: #p
keyword: freq=noraman
keyword: PBEPBE/SDD
title: #p freq=noraman PBEPBE/SDD
converged: YES YES NO NO
title: Mulliken charges:
elementType: I N N N C C C C C C C C H H H H H H H H H H
charge: 0.041250 -0.094227 -0.633818 -0.645174 0.610326 -0.614638 -0.490798 -0.384106 -0.170273 -0.229596 -0.232298 0.237134 0.223263 0.184759 0.236740 0.246175 0.229003 0.233237 0.323474 0.294961 0.312175 0.322430
chargesum: 0.00000
title: Mulliken charges with hydrogens summed into heavy atoms:
elementType: I N N N C C C C C C C C
charge: 0.041250 -0.094227 -0.015382 -0.010569 0.610326 -0.206617 -0.490798 -0.147366 0.075901 -0.000593 0.000940 0.237134
polarizability: 1.74886421e+02 2.68920748e+01 1.38392220e+02 7.75967654e+00 -5.95181243e+00 7.75248215e+01
1716.lowfreq: -8.4835 -0.0006 -0.0004 -0.0003 2.6778 10.6734 20.5631 34.9607 76.0054
frequency: 18.8073 34.8803 75.9829 124.3159 156.4944 195.2628 225.3002 252.3786 297.0717 372.2274 388.6588 400.9236 433.3453 456.6814 467.0894 501.6298 546.7796 558.8464 600.1200 636.8908 668.6829 720.9229 756.1237 820.2978 853.5336 878.3346 946.8199 971.2975 985.7079 991.5339 994.0967 1040.4034 1043.1573 1116.3538 1166.3967 1173.3208 1206.2407 1217.4982 1281.7260 1350.0277 1370.2620 1408.2903 1418.6155 1445.7825 1458.1958 1570.4310 1594.5995 1597.3230 1615.3068 1664.2895 2873.3799 2970.4011 3125.1142 3138.0434 3155.8043 3170.9396 3528.2031 3536.3713 3678.9845 3679.8337
redmass: 5.9037 4.3635 3.9788 4.3722 5.7607 5.8216 3.6009 4.1688 4.3076 1.9810 1.3931 1.1977 2.6733 1.9001 1.5836 3.0962 2.2969 1.5404 4.5843 6.7190 5.3707 4.0680 1.2702 3.9911 2.3930 2.0037 1.4184 1.8980 1.3702 4.5006 3.2286 1.9587 1.5653 1.6589 1.6000 1.1775 1.8678 1.4619 1.3490 1.3238 7.2137 4.1425 2.1469 1.5071 1.5395 5.9574 6.6537 1.2663 1.2979 3.2584 1.0657 1.0907 1.0864 1.0896 1.0950 1.0997 1.0447 1.0458 1.1024 1.1015
irintensity: 0.4753 6.1031 2.1487 1.1868 5.6278 2.3658 1.7352 5.9161 7.8341 16.6521 51.2337 84.2303 11.3875 109.9548 235.2344 22.2922 63.7905 108.8202 19.2852 18.1845 62.1793 4.1240 91.7152 10.2989 3.8526 0.8575 1.3971 1.3202 0.7384 68.9797 7.3960 4.0867 6.9275 0.3956 3.1584 1.5139 6.0367 1.2205 1.1117 59.4926 2.3598 119.7132 32.4318 22.9595 9.1906 16.0347 5.3754 103.9639 122.0586 557.2764 75.0745 42.1724 3.3723 10.4380 21.3107 22.2073 29.2682 12.4198 23.3051 13.9048
temp: 298.150 k
press: 1.00000 atm
elementType: 53 7 7 7 6 6 6 6 6 6 6 6 1 1 1 1 1 1 1 1 1 1
symmnumber: 1
zpe: 448159.0 jmol-1
zpe.correction: 0.170695 hartree
zpe.thermalcorrener: 0.182995 hartree
zpe.thermalcorrenthalpy: 0.183939 hartree
zpe.thermalcorrgfe: 0.129427 hartree
zpe.sumelectzpe: -485.721047 hartree
zpe.sumelectthermal: -485.708747 hartree
zpe.sumelectthermalent: -485.707803 hartree
zpe.sumelectthermalfe: -485.762315 hartree
dipole: -2.0534 0.5545 -1.0688
dipole: 2.3804
quadrupole: -62.0387 -85.0232 -83.0343
quadrupole: 2.3024 2.4059 -1.3810
quadrupole: 14.6600 -8.3244 -6.3356 2.3024 2.4059 -1.3810
hfenergy: -485.8917417 hartree
pointgroup: C01 [X(C8H10I1N3)]
dipole: 0.8166191 0.1417655 0.4359801 debye
dipolederiv: -0.1485432 0.258868 -0.0102867 0.2203529 -0.3993846 -0.0005959 -0.0239304 0.0066332 -0.0412047 -1.4555064 0.0943023 0.2091554 0.34669 -0.4688188 -0.0452722 0.0194211 0.0851904 -0.4771994 -0.7122348 0.0334687 0.40452 0.2410574 -0.6678801 -0.2072352 0.6382624 -0.0854491 -0.8688848 -1.024701 -0.0830466 -0.3782091 -0.0551616 -0.42697 0.1566619 -0.4735574 0.2219685 -0.7423485 0.0561153 0.2150323 0.0586928 0.0216244 -0.3736447 -0.0171753 -0.0307374 -0.0472751 -0.0195756 0.6108028 0.0811594 -0.1129091 0.0602427 0.3197907 0.0101227 -0.1789552 0.0399567 0.3430648 0.2076682 -0.5787515 0.0277036 -0.4293613 0.8716818 0.0061026 0.0163288 0.0213222 -0.141758 -0.0353668 -0.0793134 0.020322 0.0664053 0.0828811 0.0656223 0.0378705 -0.0029118 -0.1316384 -0.1412748 0.1508966 -0.0011728 0.2337879 -0.221762 0.0653755 0.0367323 0.0307829 -0.0839623 -0.0400057 -0.0621648 0.0276192 -0.0808981 0.0327069 0.0226786 0.0230363 0.0179523 -0.1324346 0.0202249 0.0512719 0.0841183 -0.0451033 0.0236297 0.0113358 0.0496507 0.0564338 -0.1275225 1.8170559 -0.3412868 -0.291314 -0.8049372 0.4048188 -0.2330094 -0.1672039 -0.2576242 1.2888179 -0.0324749 0.0205239 0.0429572 0.007818 -0.1099277 -0.1618014 0.1158173 -0.0929545 -0.0338884 -0.0754656 0.0339657 -0.0334927 -0.0265779 -0.0442852 0.1908625 0.0807284 0.092062 -0.1201835 0.0658642 -0.0589481 -0.0533563 -0.0441752 -0.0750535 -0.0571723 -0.0347672 -0.0650376 0.1164376 0.0743934 -0.039667 -0.0325487 -0.0730281 -0.0289586 -0.0571955 -0.0365973 -0.052254 0.1348133 0.0055616 0.1095285 -0.0237748 0.1216881 -0.0547742 -0.0083902 -0.0302005 -0.0098084 0.1494981 -0.1059169 0.0116761 -0.0854241 0.0042072 0.0636044 -0.0190783 -0.0915275 -0.017799 0.1323229 0.1769131 0.0449939 -0.0280851 0.0286032 0.2997439 0.0989674 -0.0507541 0.0416642 0.2246523 0.0986272 -0.0098026 -0.0098371 -0.1343733 0.360847 0.0923142 -0.0455165 0.0162638 0.1853645 0.3357245 0.0721082 0.0585635 0.2263241 0.1815585 0.044693 0.0272912 -0.0246567 0.1796094 0.302539 0.0751852 0.1267584 0.1148146 0.2301966 0.0421893 0.1186084 0.0255404 0.1660201 unknown
polarizability: 169.9651585|-29.7926139|142.8085566|8.9843152|6.2325599|78.0297481 unknown
InChI: InChI=1S/C8H10IN3/c9-7-4-2-1-3-6(7)5-12-8(10)11/h1-4H,5,10-11H2
charge 0 multiplicity 1
22 atoms
I  0.027979 -2.575158 0.042873
N  1.734498 0.727997 -0.190109
N  3.689364 0.078903 -1.303814
N  3.552728 -0.416661 0.980302
C  -0.625564 0.467906 0.4610
C  0.808628 0.633732 0.955163
C  -1.166285 -0.764923 0.020381
C  -1.481281 1.600449 0.414713
C  -2.491975 -0.879063 -0.452144
C  -2.809296 1.512588 -0.053862
C  -3.31688 0.268617 -0.489185
C  2.91859 0.158257 -0.136264
H  0.857343 1.570381 1.548905
H  1.036271 -0.209918 1.652261
H  -1.079342 2.566209 0.743415
H  -2.879358 -1.845977 -0.785516
H  -3.441634 2.406564 -0.080138
H  -4.345519 0.181569 -0.85556
H  3.226134 0.411843 -2.147676
H  4.702583 0.166304 -1.24452
H  4.194917 -1.194952 0.838369
H  3.109998 -0.341765 1.892505
