program: Gaussian 09
title: 000005561
version: EM64L-G09RevD.01
frameworkgroup: C1[X(C6H12Cl3N)]
method: RPBEPBE
basis: SDD
operation: Freq
keyword: #p
keyword: freq=noraman
keyword: PBEPBE/SDD
title: #p freq=noraman PBEPBE/SDD
converged: YES YES NO NO
title: Mulliken charges:
elementType: Cl Cl Cl N C C C C C C H H H H H H H H H H H H
charge: -0.065485 -0.065176 -0.065484 -0.112020 -0.337882 -0.337991 -0.338503 -0.563565 -0.564072 -0.564221 0.237213 0.239133 0.237596 0.239002 0.237662 0.239161 0.263191 0.264817 0.263308 0.264975 0.263612 0.264729
chargesum: 0.00000
title: Mulliken charges with hydrogens summed into heavy atoms:
elementType: Cl Cl Cl N C C C C C C
charge: -0.065485 -0.065176 -0.065484 -0.112020 0.138464 0.138607 0.138320 -0.035557 -0.035789 -0.035880
polarizability: 1.21194637e+02 1.20755411e-01 1.20683240e+02 -1.98166428e-02 -5.20765561e-02 7.14512153e+01
1716.lowfreq: -10.5502 -6.6639 -0.0036 -0.0030 -0.0022 2.3220 22.2268 28.7718 30.6183
frequency: 21.5120 28.6227 30.4593 76.3112 80.5815 85.4837 113.4821 195.1733 196.6115 205.1347 284.0632 285.7926 353.8031 463.5527 466.0679 662.2587 664.0370 667.0528 765.9022 774.1809 775.7992 831.8746 997.7019 999.5175 1000.8544 1048.7172 1050.0039 1055.6790 1106.4313 1107.7275 1139.5214 1234.8544 1237.8016 1248.7004 1256.2096 1258.4859 1282.9744 1323.0626 1325.4531 1361.7714 1363.6402 1371.7718 1446.6465 1448.1206 1452.1315 1466.7122 1467.4601 1469.0635 2960.5359 2963.2845 2966.4229 3043.5616 3049.5472 3050.3312 3053.1702 3054.0070 3054.9221 3138.6477 3141.3487 3142.2346
redmass: 4.4250 7.7828 8.8764 2.4643 2.4126 2.3592 3.5635 4.4594 4.4381 12.2225 4.0055 4.0383 5.3141 2.9918 2.9463 7.0344 5.7946 5.9196 1.1142 1.1415 1.1430 4.4382 1.5704 1.5667 1.4600 3.0215 3.0420 4.3303 1.6189 1.6076 1.1592 1.3239 1.2937 1.1813 1.4617 1.4092 1.1119 1.3962 1.4080 1.3557 1.3521 1.2763 1.0870 1.0855 1.0878 1.0844 1.0853 1.0940 1.0643 1.0638 1.0650 1.0975 1.0783 1.0816 1.0758 1.0700 1.0603 1.1124 1.1125 1.1124
irintensity: 0.8173 0.5662 0.6895 2.2826 2.5036 2.0686 0.0085 6.4252 6.1877 5.8475 1.2738 1.1554 27.5672 4.6624 4.6321 22.9322 131.7605 114.8137 0.9754 7.6849 7.9492 7.6386 6.1829 6.0547 3.7190 1.3065 1.3622 1.2968 58.8700 60.2511 0.0393 18.5866 22.5334 6.6301 13.9076 16.1181 0.0985 20.0028 20.8836 7.2488 7.1768 0.4008 3.7448 3.6092 5.3618 8.2532 7.9126 22.6539 24.7224 21.7281 67.8463 1.1624 12.0489 11.1665 25.2587 25.2134 33.8179 7.2467 26.7244 27.0515
temp: 298.150 k
press: 1.00000 atm
elementType: 17 17 17 7 6 6 6 6 6 6 1 1 1 1 1 1 1 1 1 1 1 1
symmnumber: 1
zpe: 461559.9 jmol-1
zpe.correction: 0.175799 hartree
zpe.thermalcorrener: 0.188883 hartree
zpe.thermalcorrenthalpy: 0.189827 hartree
zpe.thermalcorrgfe: 0.131377 hartree
zpe.sumelectzpe: -1669.927227 hartree
zpe.sumelectthermal: -1669.914142 hartree
zpe.sumelectthermalent: -1669.913198 hartree
zpe.sumelectthermalfe: -1669.971648 hartree
dipole: -0.0080 -0.0127 0.4733
dipole: 0.4735
quadrupole: -99.7064 -99.4540 -79.9011
quadrupole: -0.0292 0.0040 -0.0132
quadrupole: -6.6859 -6.4335 13.1194 -0.0292 0.0040 -0.0132
hfenergy: -1670.1030254 hartree
pointgroup: C01 [X(C6H12Cl3N1)]
dipole: 0.0040013 -0.0040105 -0.1862116 debye
dipolederiv: -0.8400649 0.0919441 -0.0769036 0.0584984 -0.186065 0.0149081 0.0162725 0.0052748 -0.1930149 -0.4164291 -0.3010659 0.0516515 -0.338158 -0.6055206 0.0583985 -0.0018728 -0.0160872 -0.1920483 -0.2855139 0.2646135 0.0262629 0.2279776 -0.7397234 -0.0748529 -0.0125148 0.0098341 -0.1926725 -0.9703166 0.013677 -0.0008918 -0.0199321 -0.9556628 -0.0049164 0.0009684 -0.0010655 -0.5383398 0.6661264 -0.0848448 -0.0684252 -0.1330696 0.0717796 0.0460279 0.2552262 0.0286298 0.2634905 0.3196095 0.3395988 0.0801291 0.287828 0.4151897 0.0401167 -0.0972112 -0.2270549 0.2664524 0.1235277 -0.1714963 -0.0056659 -0.2242754 0.6074626 -0.0848714 -0.1523642 0.200004 0.2663005 0.9818861 -0.0848491 0.0288582 -0.0394507 0.2070565 0.0081231 -0.1277166 0.040949 0.0879564 0.4527906 0.3408082 -0.006108 0.3901123 0.7309049 -0.0295614 0.0974815 0.0845281 0.0895461 0.3497148 -0.3313908 -0.022882 -0.2826723 0.8397229 0.0220729 0.0267662 -0.127614 0.0881297 0.0138422 -0.0569382 0.0074309 -0.0655723 -0.0906561 0.0775066 -0.0123439 0.0576983 0.0580733 -0.0325877 0.0462332 0.0299536 0.0982315 -0.0163197 -0.13121 0.0341032 -0.0948055 -0.0652689 -0.0132318 0.0811286 0.0574942 0.0747738 -0.06287 -0.0408989 0.0513963 -0.0143546 0.063088 -0.0800535 -0.0741611 -0.1289302 -0.0205439 0.032904 0.0366276 -0.10069 0.0123139 -0.0750343 -0.1183489 -0.012289 -0.0684123 -0.0192135 0.041008 -0.0315502 -0.0419964 -0.0394935 0.0600109 0.0430079 -0.0557089 0.0986316 -0.0018214 -0.0898166 0.0922498 0.0639213 0.0779443 -0.0683221 -0.0231756 0.0372539 0.0573023 0.0172891 0.0030349 -0.1050078 0.0167283 -0.0748404 -0.0266115 -0.0413996 -0.0630075 0.0404999 -0.038848 -0.0708148 0.0668398 0.0094861 0.0353113 0.054791 -0.0210004 -0.0187291 -0.119197 -0.0374891 0.0082516 -0.0003857 -0.0711192 0.0218912 -0.0324205 -0.0203698 0.0292929 0.0346001 0.0523703 -0.0961928 -0.0636879 0.0226712 -0.021559 0.0582928 0.0226977 0.0097035 0.0600404 -0.0097651 -0.039366 0.1030102 0.0554648 0.052319 -0.0285275 -0.1107109 0.0002269 -0.0754387 0.0237303 -0.004307 0.0010612 -0.0326568 -0.0098232 0.0561285 unknown
polarizability: 121.2211873|-0.0171292|120.6564243|-0.0346387|0.1224159|71.4514811 unknown
InChI: InChI=1S/C6H12Cl3N/c7-1-4-10(5-2-8)6-3-9/h1-6H2
charge 0 multiplicity 1
22 atoms
Cl 4.025631 -0.586421 0.395397
Cl -2.543796 -3.169886 0.392866
Cl -1.497635 3.766444 0.399148
N  0.004666 -0.006965 -0.486834
C  1.464228 -0.079491 -0.652735
C  -0.789618 -1.23386 -0.650749
C  -0.661895 1.293382 -0.653195
C  2.15064 -0.496641 0.660741
C  -1.532624 -1.587729 0.650147
C  -0.626771 2.102322 0.656315
H  1.846407 0.912395 -0.957342
H  1.746436 -0.795562 -1.4521
H  -0.11743 -2.069643 -0.918486
H  -1.527614 -1.133686 -1.473958
H  -1.71541 1.1292 -0.945904
H  -0.189824 1.890836 -1.460606
H  1.991628 0.237524 1.464656
H  1.853514 -1.503985 0.990334
H  -0.840342 -1.797795 1.479077
H  -2.264055 -0.817922 0.939973
H  -1.166675 1.597435 1.471272
H  0.398439 2.354549 0.967881
