program: Gaussian 09
title: 000002420
version: EM64L-G09RevD.01
frameworkgroup: C1[X(C10H12N2O2)]
method: RPBEPBE
basis: SDD
operation: Freq
keyword: #p
keyword: freq=noraman
keyword: PBEPBE/SDD
title: #p freq=noraman PBEPBE/SDD
converged: YES YES NO NO
title: Mulliken charges:
elementType: O O N N C C C C C C C C C C H H H H H H H H H H H H
charge: -0.176687 -0.176688 0.055897 0.055897 0.519085 0.519092 -0.345116 -0.345125 -0.431711 -0.431726 -0.369802 -0.369804 -0.691973 -0.691962 0.252464 0.252466 0.239202 0.239200 0.243540 0.243545 0.236891 0.234271 0.233937 0.236893 0.234274 0.233939
chargesum: 0.00000
title: Mulliken charges with hydrogens summed into heavy atoms:
elementType: O O N N C C C C C C C C C C
charge: -0.176687 -0.176688 0.055897 0.055897 0.519085 0.519092 -0.092651 -0.092659 -0.192510 -0.192525 -0.126262 -0.126258 0.013126 0.013143
polarizability: 2.45745775e+02 -1.30307441e+01 1.00448435e+02 -2.01077880e-03 -4.68463203e-03 1.12543417e+02
1716.lowfreq: -13.2489 -2.2076 -0.0007 -0.0005 0.0005 10.2280 19.8116 28.4373 57.0449
frequency: 19.7448 27.9302 57.0445 59.0157 92.9171 128.3139 161.3605 178.8576 179.5374 226.1846 256.1203 257.7032 321.2048 381.7016 401.4483 406.8212 444.0681 456.1380 473.9695 559.4174 585.9581 630.6494 703.8638 730.4967 760.1461 772.8554 810.8341 839.8002 843.4610 952.9306 969.0591 970.0809 975.7544 1012.0232 1043.8645 1045.4315 1071.0559 1094.9491 1137.6951 1188.6146 1201.3919 1208.3084 1250.7485 1250.9672 1288.0719 1297.8354 1343.9995 1381.8736 1381.9036 1390.4705 1407.8078 1415.3467 1418.7764 1462.3733 1463.8179 1473.7281 1473.9096 1500.8401 1575.0494 1610.9767 2993.2571 2993.4267 3009.1233 3009.5149 3093.4887 3093.5892 3099.3949 3099.5405 3122.3000 3140.1015 3144.8228 3162.2901
redmass: 5.8869 6.1868 9.9239 4.5051 5.8943 4.4277 3.2797 1.0419 1.0615 3.8294 4.1176 6.6154 4.5095 5.1107 3.2812 3.5672 5.5668 4.7304 5.1628 2.6409 4.2961 7.0782 3.6591 4.1205 3.5254 2.3065 3.2575 1.3235 1.5299 1.4365 1.6677 1.6992 2.5141 2.6657 1.4747 1.4658 2.2672 2.3841 1.4890 1.3712 1.7699 1.8968 1.4132 1.3757 1.4283 1.8251 1.3008 1.2828 1.2842 4.5351 6.1919 2.4352 7.7707 1.0626 1.0558 1.0530 1.0497 2.4841 6.4321 6.2316 1.0349 1.0349 1.0859 1.0859 1.1006 1.1006 1.0998 1.0999 1.0872 1.0874 1.0968 1.0967
irintensity: 3.9832 0.6942 0.3735 1.8093 1.8430 0.0201 0.0153 0.0162 0.0000 0.9690 0.4123 0.2280 6.3588 0.1201 0.8219 1.1813 0.2530 0.5695 7.6944 56.0580 0.0123 3.2968 70.3123 1.9191 3.0421 16.4566 1.1896 11.2219 58.9501 0.4773 0.1955 0.5418 15.0381 1.3167 0.0048 10.1798 3.5747 50.3402 6.8037 0.1517 17.3424 0.0244 0.0071 7.3243 6.5895 0.1751 4.2184 9.4920 43.4028 0.3782 558.3900 8.4709 2.2636 6.6024 7.1059 10.3352 18.2840 10.3329 0.1313 0.0110 35.5589 7.0611 11.4974 23.1874 40.4734 0.0024 10.4520 25.3926 6.0003 5.3772 17.7355 5.6008
temp: 298.150 k
press: 1.00000 atm
elementType: 8 8 7 7 6 6 6 6 6 6 6 6 6 6 1 1 1 1 1 1 1 1 1 1 1 1
symmnumber: 1
zpe: 526285.5 jmol-1
zpe.correction: 0.200452 hartree
zpe.thermalcorrener: 0.215146 hartree
zpe.thermalcorrenthalpy: 0.216090 hartree
zpe.thermalcorrgfe: 0.156520 hartree
zpe.sumelectzpe: -647.021446 hartree
zpe.sumelectthermal: -647.006752 hartree
zpe.sumelectthermalent: -647.005807 hartree
zpe.sumelectthermalfe: -647.065378 hartree
dipole: 0.0001 0.0000 0.7383
dipole: 0.7383
quadrupole: -94.6169 -87.3321 -77.1489
quadrupole: 21.8988 0.0033 -0.0018
quadrupole: -8.2510 -0.9661 9.2171 21.8988 0.0033 -0.0018
hfenergy: -647.2218978 hartree
pointgroup: C01 [X(C10H12N2O2)]
dipole: -0.0000417 0.0002066 -0.2904784 debye
dipolederiv: -0.8699527 -0.4257499 0.0046599 -0.7214393 -0.4507387 0.0876071 -0.8275367 -0.3475061 -0.1907206 -0.8702166 -0.4258078 -0.0052366 -0.722332 -0.4509459 -0.0879675 0.8265711 0.3470697 -0.190345 0.9491785 0.6603264 0.0184509 1.1032282 0.5227553 -0.1530389 0.4779586 0.0572204 0.0696822 0.9494286 0.6603865 -0.0175877 1.1036667 0.5225093 0.1536622 -0.4764928 -0.0565385 0.0697548 0.2650995 0.0304539 -0.0394451 -0.1862312 -0.1414179 -0.0032582 0.0238262 0.0540473 -0.0353772 0.2651408 0.0303686 0.0394992 -0.1862612 -0.141323 0.0031169 -0.0240306 -0.0541685 -0.0354366 -0.3143772 -0.2619836 0.0465379 -0.1871121 -0.06051 0.0498453 0.4460129 0.1610233 0.1322615 -0.3143696 -0.2618821 -0.0468747 -0.1864858 -0.0602821 -0.0500889 -0.4463036 -0.1612558 0.1319857 -0.1044084 -0.0293596 0.0813764 -0.0587191 -0.1168585 0.0004841 0.0356349 -0.0209764 0.0651577 -0.104439 -0.0292714 -0.0814166 -0.0586661 -0.1168746 -0.0006872 -0.03572 0.0207651 0.0651854 -0.0283716 -0.00532 -0.0755218 0.0399912 -0.1193124 0.0186817 -0.0746673 0.0292804 0.0375877 -0.0283864 -0.0053904 0.0755201 0.0399278 -0.1192602 -0.0188479 0.0747319 -0.0294535 0.0375324 0.0496925 -0.0143841 0.0130848 -0.0072028 0.0010693 -0.0384453 -0.0766901 0.035482 0.0247174 0.0496723 -0.0143857 -0.0130997 -0.0073213 0.0010853 0.0384075 0.0766839 -0.0355328 0.0247254 0.0011387 -0.0111462 -0.0209372 -0.0202002 -0.0032951 -0.0178045 -0.054287 0.0356369 -0.1228891 0.0011314 -0.0111799 0.0209326 -0.0202795 -0.0032646 0.0179396 0.0542576 -0.035491 -0.1229101 0.0210274 0.0241428 -0.1008908 0.030199 0.1350708 0.0183304 -0.0683454 0.0171493 -0.0319497 0.021024 0.0240279 0.1009203 0.0301284 0.1351134 -0.0181442 0.068385 -0.0169602 -0.0319893 0.0296878 0.0206426 0.0839815 -0.0025228 0.1317958 -0.0211457 0.0728677 -0.0283729 -0.0181227 0.0296932 0.0207373 -0.0839546 -0.0024368 0.1317413 0.0213105 -0.0728657 0.0285383 -0.0180631 0.0812594 -0.0779556 0.04321 -0.0296304 -0.0502472 0.0393374 0.0424987 0.0396402 0.0633868 0.0922185 0.0110607 -0.0774955 0.0023226 0.0874606 0.0571748 -0.0399718 -0.0068565 -0.0879114 -0.1721741 0.0792915 0.0025348 0.0373352 0.0642055 -0.0179219 -0.0037096 -0.0263107 0.0941805 0.0812579 -0.0778986 -0.0433104 -0.0295893 -0.0501358 -0.0394731 -0.0425325 -0.0397784 0.0632872 0.0922128 0.0109691 0.0775086 0.0022749 0.0875221 -0.0569645 0.0399826 0.0070722 -0.0879644 -0.1721675 0.0793078 -0.0024462 0.0373559 0.0641371 0.0178899 0.0037419 0.0262763 0.0942344 unknown
polarizability: 246.4586154|8.1066848|99.7355947|0.008358|-0.0048113|112.5434176 unknown
InChI: InChI=1S/C10H12N2O2/c1-7(11-13)9-3-5-10(6-4-9)8(2)12-14/h3-8H,1-2H3
charge 0 multiplicity 1
26 atoms
O  -4.322484 -1.306067 -0.284351
O  4.322425 1.306138 -0.282458
N  -3.555268 -0.649824 0.478145
N  3.554965 0.649106 0.479111
C  -1.397171 0.295163 -0.208346
C  1.396836 -0.294913 -0.208652
C  -2.888688 0.578165 -0.220815
C  2.888342 -0.577962 -0.22141
C  -0.692087 0.136122 -1.42848
C  0.691774 -0.13451 -1.42862
C  -0.689741 0.14195 1.013931
C  0.689393 -0.143051 1.013783
C  -3.319297 1.808248 0.605264
C  3.318837 -1.809102 0.60316
H  -3.271207 0.637702 -1.258153
H  3.270899 -0.636239 -1.258805
H  -1.226939 0.234464 -2.380579
H  1.226643 -0.231792 -2.380819
H  -1.220802 0.245043 1.965941
H  1.220443 -0.2472 1.965685
H  -2.809604 2.709558 0.222058
H  -3.053646 1.686343 1.669319
H  -4.410242 1.964751 0.537338
H  2.809091 -2.7099 0.21882
H  3.053154 -1.688495 1.667354
H  4.409773 -1.965597 0.535078
