program: Gaussian 09
title: 000005595
version: EM64L-G09RevD.01
frameworkgroup: C1[X(C17H20N2O2)]
method: RPBEPBE
basis: SDD
operation: Freq
keyword: #p
keyword: freq=noraman
keyword: PBEPBE/SDD
title: #p freq=noraman PBEPBE/SDD
converged: YES YES NO NO
title: Mulliken charges:
elementType: O O N N C C C C C C C C C C C C C C C C C H H H H H H H H H H H H H H H H H H H H
charge: -0.308365 -0.272583 -0.061977 -0.404357 -0.149892 -0.138680 -0.486967 -0.483237 -0.469019 -0.493359 0.045914 -0.646860 0.177375 0.113220 0.169499 -0.334232 0.238702 -0.388350 -0.356440 -0.240869 -0.213291 0.230342 0.230712 0.225795 0.231472 0.230207 0.216368 0.234595 0.222119 0.226567 0.208011 0.243981 0.228006 0.226430 0.195424 0.284326 0.312709 0.279974 0.229272 0.224137 0.223321
chargesum: 0.00000
title: Mulliken charges with hydrogens summed into heavy atoms:
elementType: O O N N C C C C C C C C C C C C C C C C C
charge: -0.308365 -0.272583 -0.061977 -0.091648 0.080450 0.092032 -0.029700 -0.036662 -0.012305 -0.058781 0.289895 0.003000 0.177375 0.113220 0.169499 -0.049906 0.238702 -0.108376 -0.127169 -0.016732 0.010029
polarizability: 2.91059155e+02 -8.65931598e+00 1.96064104e+02 -5.18585229e+00 -4.10610851e-01 1.22905575e+02
1716.lowfreq: -8.4182 -0.0006 0.0008 0.0010 3.3619 14.3333 28.0192 34.6172 38.4357
frequency: 26.9932 33.6012 38.3711 73.8728 103.4346 128.4639 157.6610 175.2634 185.7234 206.9667 222.8535 233.4759 276.6118 290.9391 322.6367 357.7420 367.1299 393.5769 425.5704 431.0292 440.6043 494.8941 501.6455 562.9355 563.6635 574.5071 605.6351 611.8619 629.6885 694.1820 713.8961 739.8562 756.0991 757.4035 761.0695 774.8040 775.9331 782.5933 820.3057 841.2983 850.1453 864.6436 867.5225 867.9299 910.7015 935.4729 945.0318 962.3606 978.4191 980.0348 986.2733 997.2504 1009.1825 1034.8259 1042.5203 1070.9981 1090.6239 1109.1022 1112.8860 1121.4677 1128.6025 1147.1156 1149.3091 1156.4045 1168.0764 1195.6712 1204.8440 1224.9242 1241.9008 1244.5245 1250.5645 1254.4694 1271.9966 1287.6597 1291.1229 1293.6013 1310.3427 1315.5015 1341.1932 1353.5152 1355.6979 1368.0848 1394.4764 1424.9419 1429.9378 1450.0199 1452.7368 1461.3045 1464.7705 1465.4769 1483.4891 1485.3382 1486.1666 1523.2746 1589.2401 1620.1637 1635.0285 2883.6135 3001.7829 3002.4986 3009.0539 3015.2704 3016.9395 3022.7253 3039.3303 3049.4705 3055.4734 3070.5562 3076.4431 3077.4776 3082.0420 3127.6518 3140.1794 3158.4926 3176.8513 3246.1789 3602.4793
redmass: 4.6569 4.3476 4.4428 6.5389 4.8285 5.3168 4.4489 2.0207 4.4126 1.0786 4.0132 3.5332 2.9735 3.2943 3.9368 2.6784 2.6625 6.6931 2.9124 5.2319 2.3108 3.5582 4.5246 3.9841 1.6598 3.2474 3.5317 2.3254 6.3303 4.6931 4.8068 4.4532 4.8954 1.3871 4.4640 3.2912 3.8600 2.1770 2.5247 2.4783 1.4723 1.4463 1.8183 3.5153 3.4468 3.9545 1.3711 2.0892 2.3125 1.9281 1.3057 6.8811 2.0702 1.9633 1.6372 2.0357 1.9041 1.6533 1.3440 1.5875 1.9417 1.3339 1.7248 2.0201 1.1887 1.4837 1.5650 1.4170 1.6037 1.5896 2.6540 1.2679 1.3873 1.5934 1.9875 1.6898 1.3895 1.3242 1.6065 1.7697 1.6530 1.4956 5.3692 2.4199 1.1660 1.0879 4.0019 1.0908 1.0720 1.0626 1.0546 2.9648 1.1005 5.9028 6.4705 11.0198 7.1584 1.0532 1.0607 1.0591 1.0612 1.0634 1.0839 1.0759 1.0870 1.0886 1.1033 1.1026 1.1043 1.1005 1.1040 1.0856 1.0909 1.0968 1.0975 1.0990 1.0810
irintensity: 0.1382 3.1199 1.7853 0.4903 0.4421 0.1043 0.3242 0.3331 2.0457 0.2145 8.5316 11.4579 1.8940 1.2206 3.2314 2.5574 3.4420 0.5291 11.4696 7.3205 5.3169 1.2957 2.6038 4.0430 55.8753 3.8550 13.8046 34.6031 2.8579 11.8219 1.1679 0.8643 2.2823 112.8898 9.1472 9.7445 12.3859 5.9010 1.4299 3.5296 10.1696 0.6243 1.1892 2.7420 2.3881 7.4211 4.1558 3.4592 17.8728 4.9943 0.4465 478.4200 7.2621 45.2430 24.0387 26.7507 45.8729 8.7593 12.0515 173.5992 24.9613 30.0638 111.1785 1.0965 23.9774 0.8093 8.9996 7.1104 1.4032 60.9944 23.1166 3.2932 0.9684 6.4465 40.7921 35.4459 6.0272 4.4829 24.4456 3.1085 2.6185 19.4288 96.4389 69.2837 4.6554 5.3954 28.2127 8.5197 13.1031 8.9538 4.4935 2.7227 24.5843 81.9103 17.3003 212.2263 56.9247 117.2340 23.7194 20.3856 8.5676 48.9828 10.1802 54.6759 75.9891 14.6567 6.0480 17.0130 40.6035 35.6032 63.1876 0.2201 19.6112 28.3084 10.4602 1.7871 70.8828
temp: 298.150 k
press: 1.00000 atm
elementType: 8 8 7 7 6 6 6 6 6 6 6 6 6 6 6 6 6 6 6 6 6 1 1 1 1 1 1 1 1 1 1 1 1 1 1 1 1 1 1 1 1
symmnumber: 1
zpe: 893420.1 jmol-1
zpe.correction: 0.340286 hartree
zpe.thermalcorrener: 0.358088 hartree
zpe.thermalcorrenthalpy: 0.359032 hartree
zpe.thermalcorrgfe: 0.293662 hartree
zpe.sumelectzpe: -918.230863 hartree
zpe.sumelectthermal: -918.213061 hartree
zpe.sumelectthermalent: -918.212117 hartree
zpe.sumelectthermalfe: -918.277486 hartree
dipole: -0.1459 3.2301 0.0885
dipole: 3.2346
quadrupole: -97.0543 -113.8459 -126.7839
quadrupole: 13.7375 -2.9015 1.7966
quadrupole: 15.5070 -1.2845 -14.2225 13.7375 -2.9015 1.7966
hfenergy: -918.5711483 hartree
pointgroup: C01 [X(C17H20N2O2)]
dipole: -0.0580467 1.2402309 -0.2791131 debye
polarizability: 291.183938|-8.9863987|191.3847507|-0.2695175|-17.9232071|127.4601453 unknown
InChI: InChI=1S/C17H20N2O2/c1-19-11-6-7-12(19)9-13(8-11)21-17(20)15-10-18-16-5-3-2-4-14(15)16/h2-5,10-13,18H,6-9H2,1H3
charge 0 multiplicity 1
41 atoms
O  -0.516614 0.656916 0.067016
O  0.414147 -1.417382 0.64608
N  -4.553283 0.430129 -0.880807
N  3.394449 2.003799 -0.540544
C  -3.885585 -0.913712 -0.907748
C  -4.28886 0.857879 0.5327
C  -4.317696 -1.612988 0.435266
C  -4.591258 -0.415602 1.40852
C  -2.35579 -0.670919 -0.971491
C  -2.800567 1.285245 0.619077
C  -1.885733 0.093759 0.285292
C  -5.992085 0.391193 -1.232817
C  0.56401 -0.221054 0.275223
C  1.845323 0.432866 0.011232
C  3.163683 -0.178536 0.109711
C  2.034838 1.763471 -0.38832
C  4.120202 0.833401 -0.243715
C  3.62215 -1.474822 0.457153
C  5.510468 0.593661 -0.260572
C  5.009277 -1.722087 0.441617
C  5.942257 -0.702896 0.088146
H  -4.208554 -1.477173 -1.800451
H  -4.934656 1.714012 0.79504
H  -3.531757 -2.291902 0.810574
H  -5.229336 -2.217668 0.283682
H  -5.642039 -0.412337 1.748772
H  -3.955497 -0.452745 2.311214
H  -1.809373 -1.627726 -1.052613
H  -2.138778 -0.060511 -1.866684
H  -2.627205 2.092738 -0.11449
H  -2.562602 1.674022 1.626923
H  -1.814263 -0.606182 1.138539
H  -6.098586 0.049017 -2.277721
H  -6.406968 1.413162 -1.169957
H  -6.617013 -0.273525 -0.588524
H  1.28475 2.529997 -0.566916
H  3.804513 2.891269 -0.825207
H  2.900939 -2.251043 0.727482
H  6.229688 1.37438 -0.531865
H  5.383921 -2.71719 0.705833
H  7.013885 -0.931116 0.08705
