program: Gaussian 09
title: 000039391
version: EM64L-G09RevD.01
frameworkgroup: C1[X(C9H8O)]
method: RPBEPBE
basis: SDD
operation: Freq
keyword: #p
keyword: freq=noraman
keyword: PBEPBE/SDD
title: #p freq=noraman PBEPBE/SDD
converged: YES YES NO NO
title: Mulliken charges:
elementType: O C C C C C C C C C H H H H H H H H
charge: -0.211487 0.325202 0.192915 -0.372816 -0.342514 -0.226210 -0.230771 -0.189937 -0.200049 -0.559732 0.239406 0.275432 0.233424 0.237673 0.213871 0.173675 0.221452 0.220467
chargesum: 0.00000
title: Mulliken charges with hydrogens summed into heavy atoms:
elementType: O C C C C C C C C C
charge: -0.211487 0.325202 0.192915 -0.133411 -0.067082 0.007214 0.006902 0.023934 -0.026374 -0.117814
polarizability: 1.43290830e+02 -5.09230484e+00 1.22874725e+02 2.59195420e+00 1.34124560e+00 4.12737605e+01
1716.lowfreq: -14.8514 -0.0004 0.0006 0.0010 1.9380 7.7109 72.5624 116.0796 129.2285
frequency: 72.5386 116.0763 129.2214 225.9498 236.3837 255.7825 398.5198 432.9718 455.1347 478.1560 579.2799 628.9380 652.3467 750.8993 770.7897 789.1748 824.5971 895.7675 946.7612 968.1556 985.7923 992.3391 1010.2904 1018.6968 1056.4295 1083.1163 1174.5025 1198.4017 1218.6089 1283.0102 1310.8152 1361.8101 1409.7658 1430.8303 1437.4073 1472.5129 1562.8494 1585.9710 1617.5465 1636.9778 2919.8468 3100.7489 3122.0758 3131.2476 3142.9928 3154.2030 3168.2345 3207.5872
redmass: 2.4727 4.6336 2.7578 3.0038 3.2883 3.3593 4.4437 2.7506 4.6341 3.2076 3.7137 3.7166 2.3209 2.2450 2.8432 1.7352 4.8778 1.3700 1.3392 1.5868 1.2812 1.3492 1.3971 1.8308 1.6412 2.8346 1.0943 1.5447 2.9892 1.7218 1.2613 3.0173 1.6687 1.3523 2.4265 2.2637 6.6424 5.9120 6.2748 4.3678 1.0846 1.0602 1.0918 1.0855 1.0889 1.0946 1.1007 1.1143
irintensity: 0.5891 4.0212 3.6171 5.0218 5.8056 7.5015 2.3467 11.8053 5.4086 0.4946 1.8635 8.6800 5.0203 9.7813 22.5522 60.7493 15.5514 0.5727 72.1927 0.4171 4.2803 18.7252 1.0226 9.0456 0.2396 3.9391 4.0342 12.1144 68.2717 14.0602 0.6183 1.2016 23.8938 6.7866 9.5993 20.0921 17.0632 200.9893 39.6272 4.9045 89.3348 6.5762 10.8383 1.6614 4.3232 12.6866 24.8163 20.0163
temp: 298.150 k
press: 1.00000 atm
elementType: 8 6 6 6 6 6 6 6 6 6 1 1 1 1 1 1 1 1
symmnumber: 1
zpe: 367265.8 jmol-1
zpe.correction: 0.139884 hartree
zpe.thermalcorrener: 0.148734 hartree
zpe.thermalcorrenthalpy: 0.149679 hartree
zpe.thermalcorrgfe: 0.105714 hartree
zpe.sumelectzpe: -422.246085 hartree
zpe.sumelectthermal: -422.237235 hartree
zpe.sumelectthermalent: -422.236290 hartree
zpe.sumelectthermalfe: -422.280255 hartree
dipole: 3.2959 2.1116 -0.0338
dipole: 3.9145
quadrupole: -60.4747 -53.0759 -62.1671
quadrupole: -8.2556 0.3295 1.1250
quadrupole: -1.9022 5.4967 -3.5945 -8.2556 0.3295 1.1250
hfenergy: -422.385969 hartree
pointgroup: C01 [X(C9H8O1)]
dipole: -0.2334921 -1.5091101 -0.1996827 debye
dipolederiv: -0.415256 0.0147488 0.0081781 -0.2497792 -1.2065551 -0.1357488 -0.0238596 -0.0940487 -0.3475606 0.2343935 -0.21696 -0.0373863 0.0902103 0.2020767 0.0046971 -0.0279329 0.0303584 0.0313378 -0.4073772 -0.4911635 -0.0758355 -0.2064795 -0.4525137 -0.071182 -0.0490941 -0.0787845 -0.0310917 -0.363091 0.0131815 0.0058634 -0.06832 0.0959699 -0.0096677 -0.0093913 0.0188879 -0.1512484 -0.03579 0.2401798 0.0405844 -0.1249411 0.0854364 0.0094177 -0.0147681 0.0287574 -0.0957749 0.1610077 0.0075232 0.0221192 0.0314721 0.1487249 0.0279634 0.0271305 0.023799 -0.1123584 0.1103596 -0.1083435 0.0213309 -0.0134897 -0.2840556 -0.0197282 0.0267027 -0.0245564 -0.1634887 0.16755 -0.0348453 0.0719085 0.0385377 -0.0231056 0.116667 0.1643221 0.0031187 -0.08047 0.8640163 0.4374102 0.0520245 0.3220609 1.4018462 0.1989599 0.0522644 0.1694307 0.1357291 -0.0729987 0.0836831 0.1488009 0.0755574 -0.1463847 0.1525331 0.1498549 0.1381397 -0.2333197 0.0784633 0.0688087 -0.0077408 0.0209783 -0.0831133 -0.0045209 -0.0228515 -0.0017804 0.1441744 0.1056362 0.0087043 -0.002566 0.0673454 -0.0037923 -0.006667 0.0081921 -0.0130158 0.152047 -0.0239053 -0.0908994 -0.0257847 -0.1092839 0.0005358 -0.0227902 -0.0258659 -0.0189716 0.1494387 -0.1024686 0.0455124 -0.0220479 0.0544241 0.0726343 -0.0014498 -0.0215907 -0.0050402 0.1590366 -0.012015 -0.0098798 -0.063286 -0.0781609 0.0210157 -0.0993091 -0.0834246 -0.0588643 0.0912293 -0.2281508 0.0354748 0.0062761 0.1313427 0.0284292 -0.0098085 -0.0075717 -0.0115475 0.1041267 -0.0780548 0.0711723 -0.0469698 0.0663624 0.0764177 -0.0382278 -0.0671447 -0.0092002 0.153274 0.0176806 -0.0743076 -0.0954691 -0.0478369 0.0664335 -0.0911381 -0.0749715 -0.0966819 0.0949188 unknown
polarizability: 129.5655177|-11.8820721|134.0223057|4.7955141|14.1838733|43.8514926 unknown
InChI: InChI=1S/C9H8O/c1-2-8-5-3-4-6-9(8)7-10/h2-7H,1H2
charge 0 multiplicity 1
18 atoms
O  0.771072 3.076339 0.434386
C  0.379288 -0.608004 0.043732
C  0.02869 0.782556 0.13575
C  -0.673644 -1.546493 -0.152937
C  -1.332116 1.185236 0.034484
C  -2.015217 -1.133515 -0.264677
C  -2.352206 0.2409 -0.168801
C  1.779804 -1.07917 0.181083
C  1.050391 1.852589 0.293394
C  2.275375 -2.245127 -0.318695
H  -0.436178 -2.615107 -0.181458
H  -1.549729 2.256398 0.110272
H  -2.802779 -1.881386 -0.41034
H  -3.39647 0.560457 -0.249027
H  2.468681 -0.438708 0.746063
H  2.117558 1.531544 0.263252
H  3.318876 -2.531214 -0.151247
H  1.671501 -2.930795 -0.924432
