program: Gaussian 09
title: 000005865
version: EM64L-G09RevD.01
frameworkgroup: C1[X(C21H26O5)]
method: RPBEPBE
basis: SDD
operation: Freq
keyword: #pfreq=noraman
keyword: PBEPBE/SDD
title: #p freq=noraman PBEPBE/SDD
converged: YES YES NO NO
title: Mulliken charges:
elementType: O O O O O C C C C C C C C C C C C C C C C C C C C C H H H H H H H H H H H H H H H H H H H H H H H H H H
charge: -0.456833 -0.195201 -0.253887 -0.434764 -0.250276 0.307715 -0.107619 -0.147539 -0.263364 0.169121 -0.560218 -0.662501 -0.509476 0.075723 -0.473262 0.147041 -0.832653 -0.650410 0.568978 0.043666 -0.771951 -0.163124 -0.639444 -0.373166 -0.407975 0.179351 0.276052 0.244401 0.263671 0.231620 0.236845 0.259929 0.270329 0.230815 0.255542 0.230155 0.225416 0.226372 0.242405 0.251553 0.224269 0.240089 0.211536 0.271393 0.241224 0.283301 0.367537 0.262873 0.227742 0.260689 0.254494 0.371817
chargesum: 0.00000
title: Mulliken charges with hydrogens summed into heavy atoms:
elementType: O O O O O C C C C C C C C C C C C C C C C C C C C C
charge: -0.089296 -0.195201 -0.253887 -0.062948 -0.250276 0.307715 0.168434 0.096863 0.000307 0.169121 -0.091752 -0.132243 -0.023119 0.075723 -0.017690 0.147041 -0.112324 -0.186052 0.568978 0.043666 -0.047798 0.120177 -0.376571 0.115265 -0.153482 0.179351
chargesum: -0.00027
polarizability: 3.16282199e+02 -8.75454987e-01 2.14227317e+02 -2.58480389e+01 5.52351404e+00 1.82980702e+02
1716.lowfreq: -2.3295 -2.1209 -1.5201 -1.1829 7.0744 14.4831 27.6254 39.4932 54.1468
frequency: 27.5596 39.4415 54.1354 68.8592 74.5798 92.7274 112.4400 133.2836 161.4614 170.3302 174.6156 200.8587 211.0325 217.5119 222.2517 235.5119 261.8865 268.2053 293.2990 298.8965 306.5884 318.4493 326.5748 339.2868 346.3416 363.7651 374.1061 396.5031 406.1562 423.6055 433.6681 447.6389 458.7463 473.5913 482.1787 493.7569 508.3404 514.8380 537.8434 584.5454 600.3068 616.6014 635.5571 661.5548 680.9544 695.0253 720.5972 744.5714 762.9460 789.7401 805.0971 820.8834 833.6986 862.1299 874.5506 901.0942 909.3933 914.7240 918.2707 922.1997 937.7745 950.1507 954.8530 969.4137 980.2686 994.8638 1010.6712 1014.2252 1015.3649 1033.0313 1038.4556 1050.7418 1063.4131 1083.9673 1097.9500 1104.6892 1112.7522 1119.9628 1140.1399 1146.9098 1153.3981 1159.2387 1168.5275 1185.0788 1190.2340 1195.0711 1213.7132 1227.7035 1240.4068 1243.3423 1250.0939 1255.4946 1264.8648 1275.0023 1286.7036 1289.1200 1294.4683 1300.0316 1309.7350 1325.4200 1336.4218 1346.6042 1349.3391 1350.4851 1369.6205 1376.7226 1381.1160 1383.4399 1403.1465 1440.4993 1451.4741 1455.7363 1462.8258 1464.8597 1470.9990 1479.1565 1489.2879 1489.7262 1497.9671 1557.7425 1568.1231 1612.3891 1617.3981 1661.8313 2919.4822 2934.6111 2962.1822 2970.2212 2972.8057 2983.4383 2987.1208 2990.5268 2996.7774 3000.3867 3027.4884 3040.0754 3044.2321 3051.2768 3066.9158 3070.6286 3075.0333 3080.6466 3088.0278 3095.2256 3113.8240 3126.2981 3131.2609 3156.7704 3445.3046 3450.6232
redmass: 8.5378 5.4856 7.1195 6.5056 5.1741 3.3072 5.2701 3.9671 2.7426 4.7695 3.4910 3.4806 1.5871 2.3608 2.7858 2.8726 4.7776 2.7592 2.6999 1.4767 3.4507 3.0269 2.5927 3.7692 4.4734 3.0736 3.5731 2.3717 1.8698 3.0839 3.2559 2.7015 2.9830 2.8470 3.8269 1.3196 3.5385 3.5594 3.1678 2.7391 3.6126 3.2559 3.4248 3.9127 3.7186 3.0716 3.8289 4.1988 3.6381 1.9770 2.4681 1.9876 1.5425 3.0133 2.7022 1.9722 2.0073 2.5941 2.2042 2.5801 2.2438 2.0365 1.7826 3.1873 2.2787 2.3389 2.4422 1.6848 2.3759 1.9994 2.1969 3.2668 2.8223 2.1827 2.0914 2.3246 1.9330 2.2211 1.9974 1.9593 1.7178 1.9537 2.0410 1.5204 1.2923 1.5703 1.9399 1.4570 1.3744 1.5356 1.4992 1.5498 1.3627 1.3899 1.5799 1.5406 1.7467 1.4690 1.4577 1.3152 1.3734 1.5842 1.7832 1.4960 1.7018 1.7317 1.3702 1.3544 1.1967 1.0754 1.0887 1.0793 1.0838 1.0950 1.0631 1.0676 1.0576 1.0706 1.0619 8.6699 7.8045 8.5292 9.1709 7.3525 1.0707 1.0798 1.0803 1.0663 1.0619 1.0481 1.0665 1.0617 1.0366 1.0637 1.0621 1.0990 1.0873 1.0986 1.0999 1.0980 1.1009 1.0994 1.0992 1.1028 1.0998 1.0919 1.0858 1.0989 1.0645 1.0645
irintensity: 1.8733 0.6058 0.3970 3.3929 2.5214 1.0709 7.4996 2.9519 0.0832 3.3383 6.1420 5.2673 2.0525 4.8579 3.2077 1.5354 1.1366 0.5043 0.4219 3.3902 12.1238 1.0011 4.0641 15.5070 5.6210 4.2370 29.1007 16.5436 79.3934 7.7620 7.7421 16.3004 3.7550 5.7832 10.2575 134.2886 2.9265 12.1901 4.8345 12.5735 12.0989 6.4995 7.4114 1.2579 15.9047 6.6330 1.7099 1.9674 0.9275 3.0528 3.2641 5.0505 21.0299 1.6374 8.4915 24.2664 7.3134 30.8950 17.4046 25.7938 47.3178 14.7705 3.2143 20.3751 1.6976 17.8340 5.8544 39.7723 95.0558 3.6390 22.0566 43.0820 9.3508 6.8795 5.6147 17.6277 1.6338 2.3270 23.9566 2.8374 7.6648 9.0779 22.0666 41.1490 45.2728 16.2644 2.0332 9.5556 19.3381 22.1467 97.7764 80.2789 12.1025 3.9138 5.7053 1.4092 26.8429 19.2164 6.4173 7.6352 4.6566 40.6949 2.5077 6.4563 15.9916 4.7035 64.7311 18.4116 25.2169 15.3149 4.8268 5.3929 17.7620 5.4706 12.8936 23.0199 8.2733 2.2280 4.3338 188.5466 69.3732 12.9702 125.0197 155.4998 34.3218 7.4839 2.9928 18.2652 20.9240 5.5925 25.5326 5.0648 27.1351 32.4614 28.6439 44.8682 21.5858 28.4068 13.4566 20.4707 20.1267 20.5227 31.9754 19.4798 4.4841 10.6589 0.0976 12.8991 21.5887 40.3217
temp: 298.150 k
press: 1.00000 atm
elementType: 8 8 8 8 8 6 6 6 6 6 6 6 6 6 6 6 6 6 6 6 6 6 6 6 6 6 1 1 1 1 1 1 1 1 1 1 1 1 1 1 1 1 1 1 1 1 1 1 1 1 1 1
symmnumber: 1
zpe: 1124314.2 jmol-1
zpe.correction: 0.428229 hartree
zpe.thermalcorrener: 0.452328 hartree
zpe.thermalcorrenthalpy: 0.453273 hartree
zpe.thermalcorrgfe: 0.376371 hartree
zpe.sumelectzpe: -1189.963478 hartree
zpe.sumelectthermal: -1189.939378 hartree
zpe.sumelectthermalent: -1189.938434 hartree
zpe.sumelectthermalfe: -1190.015335 hartree
dipole: -4.6962 4.6180 2.3850
dipole: 7.0048
quadrupole: -211.3400 -153.1250 -159.8128
quadrupole: -4.1424 16.1467 6.5221
quadrupole: -36.5807 21.6343 14.9465 -4.1424 16.1467 6.5221
hfenergy: -1190.3917065 hartree
pointgroup: C01 [X(C21H26O5)]
dipole: 1.863957 -1.7907094 0.9560957 debye
polarizability: 316.5989142|0.0987488|214.0386437|25.0689463|-5.876698|182.8526599 unknown
InChI: InChI=1S/C21H26O5/c1-19-7-5-13(23)9-12(19)3-4-14-15-6-8-21(26,17(25)11-22)20(15,2)10-16(24)18(14)19/h5,7,9,14-15,18,22,26H,3-4,6,8,10-11H2,1-2H3
charge 0 multiplicity 1
52 atoms
O  2.88399 -0.396819 -2.215384
O  -0.468106 2.503162 0.739047
O  4.602789 1.421494 -1.263176
O  6.350892 1.206111 0.762447
O  -6.288461 0.301995 -1.462171
C  1.887638 0.027083 0.040767
C  0.96397 -1.207843 -0.201668
C  -0.400195 -1.08683 0.506046
C  -1.120509 0.225776 0.009141
C  3.17286 -0.463019 -0.77309
C  1.872618 -2.420168 0.111459
C  1.197097 1.284307 -0.541782
C  3.287571 -1.971791 -0.391297
C  -2.564306 0.41918 0.637803
C  -1.291159 -2.320766 0.235014
C  -0.172772 1.441614 0.127204
C  2.215715 0.261035 1.538281
C  -2.70481 -2.159936 0.851157
C  -3.346918 -0.873227 0.372791
C  4.399005 0.416406 -0.513333
C  -2.495388 0.672304 2.186625
C  -3.23646 1.637741 0.021593
C  -4.539333 -0.88058 -0.298729
C  5.422016 0.11574 0.576751
C  -4.425287 1.603442 -0.64477
C  -5.170561 0.339571 -0.847431
H  0.769903 -1.226663 -1.295569
H  -0.242203 -1.013915 1.601422
H  -1.270962 0.081879 -1.085828
H  1.535604 -3.337396 -0.399522
H  1.886901 -2.634839 1.196887
H  1.059785 1.137908 -1.631026
H  1.775332 2.208798 -0.371014
H  4.056624 -2.146602 0.380847
H  3.594852 -2.519704 -1.297271
H  -0.807541 -3.225648 0.649421
H  -1.384096 -2.470627 -0.860099
H  2.706356 -0.610783 2.006122
H  2.87161 1.141272 1.666346
H  1.300298 0.471959 2.118422
H  -2.612443 -2.157858 1.95645
H  -3.338478 -3.02372 0.581966
H  -1.955897 -0.134994 2.712246
H  -1.983908 1.626113 2.390413
H  -3.518102 0.723291 2.598949
H  -2.717937 2.58937 0.185355
H  3.22604 0.484037 -2.538007
H  -5.082159 -1.818668 -0.471383
H  5.959292 -0.808608 0.259681
H  4.93331 -0.103487 1.542358
H  -4.884308 2.513616 -1.048132
H  6.261029 1.812388 -0.025725
