program: Gaussian 09
title: 000039401
version: EM64L-G09RevD.01
frameworkgroup: C1[X(C11H12ClNO2)]
method: RPBEPBE
basis: SDD
operation: Freq
keyword: #p
keyword: freq=noraman
keyword: PBEPBE/SDD
title: #p freq=noraman PBEPBE/SDD
converged: YES YES NO NO
title: Mulliken charges:
elementType: Cl O O N C C C C C C C C C C C H H H H H H H H H H H H
charge: -0.042203 -0.449214 -0.274329 -0.412235 -0.359424 0.560510 -0.315148 -0.222173 0.240907 -0.307134 -0.363487 -0.369819 -0.228937 -0.246872 -0.221578 0.223135 0.239026 0.301033 0.222300 0.236130 0.286943 0.203492 0.227189 0.259934 0.234655 0.239538 0.337762
chargesum: 0.00000
title: Mulliken charges with hydrogens summed into heavy atoms:
elementType: Cl O O N C C C C C C C C C C C
charge: -0.042203 -0.111452 -0.274329 -0.111202 0.102736 0.560510 0.143282 0.064770 0.240907 -0.307134 -0.136298 -0.166326 0.030997 -0.012217 0.017960
polarizability: 2.52889617e+02 -7.56342370e+00 1.51995294e+02 1.53083557e+01 7.43207361e-01 7.12817228e+01
1716.lowfreq: -6.6858 -3.8255 -0.0023 -0.0006 0.0005 3.3274 9.5962 36.9652 48.8852
frequency: 8.7133 36.9402 48.7256 65.9437 88.1496 110.0926 155.5788 163.9224 191.4617 215.2745 255.1020 287.8066 300.1968 321.4104 377.1262 389.3714 444.2887 489.3356 511.0626 531.1324 541.0106 581.5172 658.9276 677.4310 718.0772 735.2595 764.6294 816.9223 855.6263 863.7557 867.9458 877.9909 949.7416 953.9527 986.4869 1000.1105 1015.0028 1017.5332 1040.0998 1073.8982 1084.7702 1120.5499 1172.3487 1173.8602 1194.8817 1215.2027 1265.8936 1283.9629 1294.3890 1324.6146 1329.6582 1349.6623 1369.7823 1375.6620 1424.9755 1427.3163 1459.0915 1467.9722 1476.3215 1565.6774 1584.4904 1601.1875 1652.0828 3000.2046 3008.1384 3078.4875 3091.7513 3099.6020 3125.9763 3136.1120 3148.8376 3163.3927 3177.7753 3557.6338 3559.8178
redmass: 6.4911 5.9532 5.4259 4.4295 5.4884 3.2706 2.7432 4.4817 5.9079 4.6579 3.5170 2.9638 1.6068 2.8471 3.5386 9.0200 2.9541 2.5710 2.8868 2.9502 1.4950 5.6474 6.3943 3.9278 4.6664 2.9716 1.4506 3.3977 3.2939 1.4718 2.2864 2.0248 1.4494 2.5326 1.3428 3.0190 1.2408 5.3829 2.1146 2.0421 3.1808 1.7602 1.0780 1.2568 1.9631 1.4733 1.2171 1.6968 1.7309 1.4358 1.1935 1.3129 1.2634 4.8251 1.1747 2.3166 2.3129 1.0879 1.9026 5.8011 6.9952 6.7470 5.6305 1.0633 1.0599 1.1019 1.1039 1.0925 1.0875 1.0855 1.0902 1.0954 1.0998 1.0778 1.0663
irintensity: 0.3388 1.1463 7.9782 2.0093 3.2070 3.8004 0.8235 0.7976 2.8815 0.2907 40.9119 44.0581 103.0500 45.8156 17.0267 16.7321 12.3870 2.8630 9.3088 1.3633 37.9829 22.2483 16.1774 1.1130 11.8932 5.3619 89.8124 3.9086 19.6021 4.8577 8.6535 19.5701 1.3658 15.6672 0.8602 85.0490 46.3434 51.2995 1.2633 3.7710 20.6307 2.5845 2.7706 24.3566 122.3309 7.3787 7.0610 15.2021 75.5015 5.0450 29.3205 6.8890 23.4715 8.9793 44.7275 33.7855 29.1113 7.3926 290.8527 3.4835 154.3209 0.9641 71.5472 29.3440 35.4422 14.2403 48.6592 16.5963 2.7677 1.2837 6.8756 16.0537 14.4493 22.4663 7.1099
temp: 298.150 k
press: 1.00000 atm
elementType: 17 8 8 7 6 6 6 6 6 6 6 6 6 6 6 1 1 1 1 1 1 1 1 1 1 1 1
symmnumber: 1
zpe: 546392.2 jmol-1
zpe.correction: 0.208110 hartree
zpe.thermalcorrener: 0.223275 hartree
zpe.thermalcorrenthalpy: 0.224220 hartree
zpe.thermalcorrgfe: 0.162409 hartree
zpe.sumelectzpe: -1090.515031 hartree
zpe.sumelectthermal: -1090.499866 hartree
zpe.sumelectthermalent: -1090.498921 hartree
zpe.sumelectthermalfe: -1090.560732 hartree
dipole: 2.4137 -4.8405 -0.7614
dipole: 5.4622
quadrupole: -91.6802 -91.4679 -99.6860
quadrupole: -3.0403 9.8755 2.9155
quadrupole: 2.5978 2.8101 -5.4080 -3.0403 9.8755 2.9155
hfenergy: -1090.7231409 hartree
pointgroup: C01 [X(C11H12Cl1N1O2)]
dipole: 1.1778795 1.1835174 -1.3527986 debye
polarizability: 253.2029596|-15.5065281|95.6894722|-3.6038215|-37.0621267|127.2742017 unknown
InChI: InChI=1S/C11H12ClNO2/c12-10-4-2-1-3-9(10)5-6-11(15)13-7-8-14/h1-6,13-14H,7-8H2
charge 0 multiplicity 1
27 atoms
Cl 2.492676 -1.72992 2.343767
O  -5.103428 -0.728023 -1.69931
O  -2.202665 -0.293763 1.498424
N  -2.925176 0.875308 -0.378592
C  -4.334693 0.874658 0.053531
C  1.932255 -0.033041 0.14721
C  -5.045698 -0.459199 -0.254773
C  0.517349 -0.091702 0.539064
C  -1.926421 0.300341 0.407022
C  2.938067 -0.726086 0.881452
C  2.38501 0.722135 -0.978288
C  -0.544084 0.440917 -0.136166
C  4.301302 -0.688317 0.532827
C  3.741088 0.774386 -1.345039
C  4.706785 0.06671 -0.588887
H  -4.854614 1.697109 -0.468494
H  -4.370449 1.055611 1.144221
H  -2.667452 1.389596 -1.221812
H  -6.097967 -0.399357 0.06889
H  -4.54626 -1.282048 0.292475
H  0.274948 -0.621756 1.469724
H  -0.41973 0.977576 -1.086907
H  1.650658 1.283538 -1.565412
H  5.031583 -1.241233 1.1302
H  4.049979 1.365904 -2.213085
H  5.765759 0.101486 -0.864641
H  -4.185122 -0.929528 -2.012002
