program: Gaussian 09
title: 000005698
version: EM64L-G09RevD.01
frameworkgroup: C1[X(C10H14N4O9P)]
method: RPBEPBE
basis: SDD
operation: Freq
keyword: #p
keyword: freq=noraman
keyword: PBEPBE/SDD
title: #p freq=noraman PBEPBE/SDD
converged: YES YES NO NO
title: Mulliken charges:
elementType: P O O O O O O O O O N N N N C C C C C C C C C C H H H H H H H H H H H H H H
charge: 1.403924 -0.279291 -0.478140 -0.485042 -0.487595 -0.192892 -0.174103 -0.725250 -0.709146 -0.529354 -0.186178 -0.350552 -0.422374 -0.410951 -0.012565 -0.158829 -0.199971 -0.035204 -0.310671 0.359417 -0.038950 0.091170 0.174724 0.178135 0.292947 0.299959 0.275299 0.294235 0.244882 0.262686 0.416977 0.413125 0.396589 0.390791 0.437796 0.397485 0.430564 0.426353
chargesum: 1.00000
title: Mulliken charges with hydrogens summed into heavy atoms:
elementType: P O O O O O O O O O N N N N C C C C C C C C C C
charge: 1.403924 -0.279291 -0.065015 -0.088453 -0.487595 -0.192892 -0.174103 -0.294687 -0.282793 -0.529354 -0.186178 0.040239 0.015421 -0.013466 0.280382 0.141130 0.075329 0.259031 0.196897 0.359417 0.378027 0.091170 0.174724 0.178135
polarizability: 2.34712375e+02 -2.24504890e+00 2.09668640e+02 -1.30426950e+01 4.31908999e+00 1.12380907e+02
1716.lowfreq: -5.2182 -1.9813 -0.0005 0.0008 0.0011 4.3834 19.1370 31.1877 51.0111
frequency: 18.6360 30.8924 50.9893 61.7841 75.3337 92.3322 99.8321 110.2256 136.2738 142.3540 179.3894 182.0092 201.3629 203.4305 228.3260 239.0152 258.7028 274.6045 289.0621 299.5157 308.7517 315.8695 327.7872 329.6656 335.4417 362.7697 370.1237 379.2840 412.3665 427.2377 458.9134 493.3035 529.7360 561.1681 595.4391 602.9576 606.5595 630.8760 635.2477 645.0398 661.6806 690.4253 700.2878 700.8456 722.1791 731.1358 763.1091 781.4833 796.5345 815.6304 861.5421 870.7670 904.0892 930.7665 955.1955 966.1767 977.4444 995.1147 1005.2341 1016.5732 1037.6423 1048.7024 1054.2443 1062.2485 1073.2488 1100.5868 1113.2826 1129.9839 1150.2561 1161.9806 1213.5012 1217.4792 1234.1590 1242.1869 1260.1735 1264.9272 1269.1827 1275.6207 1308.7370 1329.4349 1343.2748 1357.8241 1361.7247 1375.4033 1380.2248 1384.8193 1393.2831 1448.6531 1456.9540 1497.0024 1565.6519 1628.7572 1678.1350 1695.7819 2994.1837 3015.0356 3032.5178 3066.1130 3067.4084 3070.4042 3091.3698 3206.6642 3424.8727 3504.7162 3557.5277 3590.3356 3593.9576 3610.9300
redmass: 8.9507 5.8255 9.4960 7.3089 6.6874 8.9091 7.8336 9.0643 6.0343 8.0391 7.0412 4.2422 5.6909 6.3147 3.2678 7.9566 6.5413 7.1486 3.1873 1.3161 5.3919 3.5794 1.6192 4.1682 3.6453 2.3348 6.6013 6.4320 5.4770 4.3926 9.1086 3.9395 6.0940 5.6688 3.6811 1.4300 4.6085 5.1845 5.0157 6.0436 5.4097 4.8949 6.0214 5.7259 9.3189 3.6327 1.2735 1.9571 4.6669 4.0260 3.7795 2.1863 1.6197 3.9163 6.4079 1.2563 2.0745 3.7208 3.5440 1.4342 4.0699 2.9220 4.1194 1.4741 3.9025 3.5929 2.8681 2.4654 2.8542 1.2828 1.6664 2.3934 1.2202 1.3131 1.4438 2.4198 1.7368 1.5324 1.4565 1.3925 1.6789 1.8764 1.4207 1.2691 1.5175 1.5858 2.0079 1.0884 1.8888 3.9846 3.5096 9.0329 8.5326 5.8070 1.0854 1.0584 1.0868 1.1144 1.0910 1.0881 1.1059 1.0861 1.0645 1.0774 1.0838 1.0665 1.0665 1.0677
irintensity: 3.2809 0.1278 2.2725 2.3153 0.7050 1.0919 3.2173 8.1388 2.1122 2.2361 4.5419 32.7349 21.1686 5.9828 3.4216 5.1745 4.4284 14.5837 50.4157 39.8740 34.7417 76.0715 62.4274 2.8804 40.1812 42.8431 40.2994 47.4820 9.2268 15.0663 31.2772 38.4435 6.7075 12.6947 46.1681 90.9064 22.4380 51.8040 7.2388 6.4340 5.0627 8.7447 56.9750 111.9469 182.0964 18.2233 164.5028 102.3717 32.9760 16.0441 27.3065 77.6590 91.4228 14.5462 183.2528 13.2027 26.6627 29.2659 38.8350 28.1902 10.7770 25.3311 174.7033 38.8972 44.5200 23.2075 276.7163 22.6984 96.5725 37.7506 12.8655 80.9950 21.2210 24.0331 37.2581 71.7056 18.0847 26.3919 16.0933 11.7053 0.8445 14.8866 44.0633 47.3806 2.3649 61.3755 48.6762 12.8102 22.5605 35.2156 94.9542 101.2920 459.9506 703.5143 10.1813 13.8721 15.5111 520.2187 44.8039 12.4681 9.5081 650.2224 110.6708 114.5648 187.7705 120.7422 106.4224 70.1600
temp: 298.150 k
press: 1.00000 atm
elementType: 15 8 8 8 8 8 8 8 8 8 7 7 7 7 6 6 6 6 6 6 6 6 6 6 1 1 1 1 1 1 1 1 1 1 1 1 1 1
symmnumber: 1
zpe: 713512.2 jmol-1
zpe.correction: 0.271762 hartree
zpe.thermalcorrener: 0.294688 hartree
zpe.thermalcorrenthalpy: 0.295632 hartree
zpe.thermalcorrgfe: 0.219155 hartree
zpe.sumelectzpe: -1624.678022 hartree
zpe.sumelectthermal: -1624.655096 hartree
zpe.sumelectthermalent: -1624.654152 hartree
zpe.sumelectthermalfe: -1624.730629 hartree
dipole: 2.7046 3.4386 -0.8953
dipole: 4.4655
quadrupole: -148.4846 -107.7766 -130.5017
quadrupole: 19.8003 3.3405 2.3924
quadrupole: -19.5636 21.1444 -1.5807 19.8003 3.3405 2.3924
hfenergy: -1624.9497842 hartree
pointgroup: C01 [X(C10H14N4O9P1)]
dipole: 1.0220034 -1.3340378 0.5122472 debye
polarizability: 232.2903977|3.05727|209.7858751|21.4607802|-1.7825372|114.6856498 unknown
InChI: InChI=1S/C10H14N4O9P/c15-5-3(1-22-24(19,20)21)23-9(6(5)16)14-2-11-4-7(14)12-10(18)13-8(4)17/h2-3,5-6,9,11-13,15-16,19-20H,1H2
charge 1 multiplicity 1
38 atoms
P  4.010169 1.601013 -0.276673
O  1.662219 -0.686456 0.985016
O  -0.918819 -2.842345 -0.46637
O  1.135727 -3.824381 0.80261
O  4.275668 -0.077975 -0.013612
O  -3.699835 3.404683 -0.70566
O  -4.78272 -1.16482 -1.144682
O  2.998892 2.1295 1.026898
O  2.775105 1.607097 -1.484079
O  5.316821 2.446124 -0.520522
N  -0.414503 0.265219 0.36583
N  -0.892934 2.412464 0.21855
N  -2.624138 -0.635473 -0.402132
N  -4.208839 1.100277 -0.890357
C  0.284343 -1.004605 0.706036
C  0.277889 -2.028505 -0.468302
C  1.577302 -2.831601 -0.179047
C  2.539541 -1.768752 0.417009
C  3.470514 -1.150452 -0.633927
C  -1.741474 0.361829 -0.081813
C  0.091024 1.535776 0.542088
C  -2.044639 1.71908 -0.169822
C  -3.35203 2.202087 -0.601119
C  -3.943597 -0.296286 -0.836525
H  -0.217097 -1.441633 1.593554
H  0.337628 -1.512688 -1.440948
H  1.984342 -3.314341 -1.086887
H  3.125046 -2.171446 1.26046
H  2.91185 -0.755658 -1.501831
H  4.210775 -1.89808 -0.969815
H  1.119292 1.766762 0.852669
H  -0.731267 -3.645329 0.099971
H  1.776917 -4.568744 0.906276
H  -0.815604 3.432695 0.244815
H  -2.330528 -1.636118 -0.431247
H  -5.160485 1.336576 -1.197283
H  3.48492 2.37775 1.854759
H  2.967422 2.198355 -2.256588
