program: Gaussian 09
title: 000039368
version: EM64L-G09RevD.01
frameworkgroup: C1[X(C6H4N4O7)]
method: RPBEPBE
basis: SDD
operation: Freq
keyword: #pfreq=noraman
keyword: PBEPBE/SDD
title: #p freq=noraman PBEPBE/SDD
converged: YES YES NO NO
title: Mulliken charges:
elementType: O O O O O O O N N N N C C C C C C H H H H
charge: -0.097203 -0.428289 -0.096490 -0.196660 -0.244792 -0.292236 -0.194612 -0.010056 -0.297146 0.020830 0.021417 -0.353359 0.335407 0.056521 0.497015 0.383236 -0.533784 0.284189 0.336482 0.416330 0.393200
chargesum: 0.00000
title: Mulliken charges with hydrogens summed into heavy atoms:
elementType: O O O O O O O N N N N C C C C C C
charge: -0.097203 -0.035089 -0.096490 -0.196660 -0.244792 -0.292236 -0.194612 -0.010056 0.119184 0.020830 0.021417 -0.069171 0.335407 0.056521 0.497015 0.383236 -0.197302
polarizability: 2.11511096e+02 -1.23259250e+00 1.96856694e+02 -2.78222521e+00 2.56624530e+00 5.17554569e+01
1716.lowfreq: -9.1724 -0.0008 0.0003 0.0004 1.7128 5.9914 53.6110 79.9728 94.4980
frequency: 53.6070 79.9725 94.4944 105.2947 129.3119 156.5391 183.4567 208.3101 243.8849 259.8568 301.4139 316.3606 341.5712 352.0960 375.7331 413.6304 430.6891 471.0278 481.6037 486.6455 576.3789 579.1795 592.6702 632.6286 641.8122 672.8472 680.9745 693.8983 711.5471 740.4064 802.8850 870.4020 928.2972 939.1589 964.8665 969.5530 1047.8730 1080.6624 1147.0580 1176.3766 1202.9103 1231.2097 1261.4905 1298.9929 1299.9714 1339.6340 1356.0561 1384.6086 1398.1973 1482.2351 1580.9148 1614.0338 1687.4585 2971.1429 3166.0298 3380.7667 3481.4844
redmass: 9.5173 13.3712 12.6361 11.6814 12.6088 13.4788 10.0201 6.7279 8.9658 8.1812 9.4363 10.5968 10.4809 10.1885 8.0276 11.8971 5.9116 3.4185 1.3445 2.0928 9.1838 2.0721 8.9530 10.8825 8.1724 7.5297 8.6582 11.3089 9.8683 7.7507 4.8616 6.9200 3.8685 5.8358 3.3229 1.5633 2.5257 3.2053 3.7476 2.7614 1.5810 1.9854 5.0259 2.7642 1.4027 6.7195 10.3681 2.7823 6.8592 9.1403 9.7834 8.7081 13.6597 1.0820 1.0917 1.0835 1.0647
irintensity: 0.3179 0.8270 2.4535 1.2194 1.3385 6.8151 7.5741 17.0525 0.1348 5.4532 0.6555 0.5288 6.4828 6.0891 18.0109 2.0930 26.0056 43.7330 96.4458 73.1287 15.0402 67.5979 8.9488 5.4642 16.6235 28.0795 13.4508 2.6028 7.5002 21.6700 3.7273 25.4216 45.3334 80.5165 117.9690 41.2920 6.0598 163.5207 34.9560 593.4800 194.4781 21.0428 46.7180 15.4015 24.2940 125.4843 320.9102 15.1064 37.2336 41.3591 455.9169 187.4851 244.0745 13.6686 15.6302 245.1163 45.2712
temp: 298.150 k
press: 1.00000 atm
elementType: 8 8 8 8 8 8 8 7 7 7 7 6 6 6 6 6 6 1 1 1 1
symmnumber: 1
zpe: 317441.7 jmol-1
zpe.correction: 0.120907 hartree
zpe.thermalcorrener: 0.135287 hartree
zpe.thermalcorrenthalpy: 0.136231 hartree
zpe.thermalcorrgfe: 0.079563 hartree
zpe.sumelectzpe: -975.054448 hartree
zpe.sumelectthermal: -975.040069 hartree
zpe.sumelectthermalent: -975.039125 hartree
zpe.sumelectthermalfe: -975.095793 hartree
dipole: -2.7478 -3.3283 -1.2165
dipole: 4.4842
quadrupole: -110.2046 -115.7348 -94.2284
quadrupole: 1.6320 1.1331 1.9725
quadrupole: -3.4820 -9.0122 12.4942 1.6320 1.1331 1.9725
hfenergy: -975.1753556 hartree
pointgroup: C01 [X(C6H4N4O7)]
dipole: 1.3253835 -1.0373005 0.5289638 debye
dipolederiv: -0.5574436 -0.2362833 -0.0056366 0.3718964 -0.6226978 0.0450856 -0.0378103 0.0490417 -0.0526314 -0.2846318 0.0839996 -0.1381686 -0.1574593 -0.6445231 -0.0927756 -0.1799556 -0.1812905 -0.5672234 -0.1930627 -0.0023933 0.004944 0.3635742 -1.3476951 0.1182806 -0.0282487 0.1254982 -0.0941455 -0.9036326 0.1492586 0.0220042 0.5761088 -0.5650961 -0.045962 0.0098697 -0.0228253 -0.2144543 -0.7323192 -0.197523 -0.0099972 -0.4429878 -0.8424507 -0.0448299 0.0011623 -0.0481144 -0.2663711 -1.038886 -0.3235928 0.0104964 -0.0193325 -0.5090989 0.0137239 -0.0035604 0.0095639 -0.2897573 -0.3040701 0.3597908 -0.0214788 -0.0442543 -1.1091157 0.0524113 0.0027324 0.0569647 -0.2216071 0.7148678 0.1134391 0.011066 -0.3924768 1.8913639 -0.1627994 0.0444933 -0.126311 0.1511198 -0.6094221 0.0535999 -0.0177328 -0.4586988 0.1572983 -0.0380943 0.009946 -0.0236883 -0.2283437 2.34792 0.2939418 -0.0175818 -0.0667603 1.0553208 0.0813369 -0.0030698 0.048092 0.1756263 1.1334996 0.3553962 -0.0129417 0.5540899 2.0476622 -0.105092 -0.0344508 -0.115147 0.1971888 0.2689027 -0.0532836 0.0993528 0.1646669 0.4903461 0.1094915 0.0925491 0.102315 0.6006199 -0.1515925 0.1493661 -0.0485687 0.2774993 -0.5613908 0.0368585 -0.0036607 -0.0272553 -0.018801 0.6802533 -0.3956604 0.0353289 -0.785571 0.8851768 -0.0588942 0.0466691 -0.0230488 0.1744736 -1.2568012 -0.3191663 0.0069399 -0.9345241 -0.1957339 -0.0635727 0.0781278 0.0114055 -0.1284813 -1.1746317 -0.287543 0.0000263 0.1818617 -1.1299492 0.0746455 -0.0117966 0.0682165 -0.047289 1.262519 0.2876553 0.0114624 0.7268073 0.0579853 -0.0078061 -0.0178269 -0.0102568 0.0010617 0.0314499 -0.0047585 0.0317525 -0.0320929 0.0024242 0.0492207 -0.0328868 0.0056705 -0.0694283 0.1264692 -0.021752 0.001521 0.0123017 0.1235241 0.0042306 -0.0149821 0.0118473 0.1869177 0.4715131 0.1009857 -0.0043542 0.0275231 0.3449225 0.007067 0.0102536 -0.0087674 0.3917587 0.1690988 -0.1054767 0.0415661 0.0778287 0.4717271 0.0274743 0.0724454 0.0980895 0.3197667 unknown
polarizability: 210.2707279|4.3539902|198.0142653|2.6871782|-4.2913349|51.8382533 unknown
InChI: InChI=1S/C6H4N4O7/c11-6-3(9(14)15)1-2(8(12)13)4-5(6)10(16)17-7-4/h1,6-7,11H
charge 0 multiplicity 1
21 atoms
O  3.052737 -1.374086 0.233113
O  -1.066055 -2.148753 -1.121895
O  1.57789 -3.38044 0.357653
O  -3.676339 0.991487 0.15341
O  -3.488909 -1.291426 0.045851
O  2.527984 2.549809 -0.049686
O  0.522832 3.672701 -0.131725
N  1.558637 -2.143509 0.266777
N  2.643375 -0.021155 0.131782
N  -2.970396 -0.085364 0.099951
N  1.201428 2.580433 -0.059209
C  -0.831975 -1.371744 0.107428
C  0.658086 -1.148661 0.18822
C  1.29783 0.132395 0.100956
C  -1.521507 -0.012412 0.094474
C  0.530903 1.319925 0.017389
C  -0.89494 1.215324 0.021599
H  -1.189758 -1.957609 0.98019
H  -1.493628 2.131457 -0.024064
H  3.321618 0.757913 0.063608
H  -2.027412 -2.413288 -1.092621
