program: Gaussian 09
title: 000039366
version: EM64L-G09RevD.01
frameworkgroup: C1[X(C21H27N2O2)]
method: RPBEPBE
basis: SDD
operation: Freq
keyword: #p
keyword: freq=noraman
keyword: PBEPBE/SDD
title: #p freq=noraman PBEPBE/SDD
converged: NO YES NO NO
title: Mulliken charges:
elementType: O O N N C C C C C C C C C C C C C C C C C C C C C H H H H H H H H H H H H H H H H H H H H H H H H H H H
charge: -0.481733 -0.267804 -0.110587 0.015482 -0.043254 -0.141597 -0.477554 -0.510919 -0.138126 -0.393757 -0.499601 -0.284273 -0.609861 -0.093908 0.368704 -0.583790 0.285744 -0.350104 -0.095867 -0.549540 -0.384763 -0.292730 0.305008 -0.348691 -0.533927 0.326592 0.275171 0.280565 0.288029 0.263310 0.267941 0.249761 0.251578 0.336844 0.260606 0.248718 0.247740 0.292347 0.261713 0.264756 0.240386 0.380984 0.242767 0.229849 0.256545 0.224030 0.257897 0.277501 0.264552 0.232832 0.237468 0.256966
chargesum: 1.00000
title: Mulliken charges with hydrogens summed into heavy atoms:
elementType: O O N N C C C C C C C C C C C C C C C C C C C C C
charge: -0.100749 -0.267804 -0.110587 0.015482 0.283338 0.133574 0.091040 0.020332 0.111634 0.194665 0.009723 -0.036533 0.208955 0.146478 0.368704 -0.111174 0.285744 -0.093559 -0.095867 -0.325510 -0.126866 -0.015229 0.305008 -0.084139 0.193339
polarizability: 2.69500630e+02 2.55028830e+01 2.75473066e+02 -1.58786812e+01 1.04415640e+01 1.91852782e+02
1716.lowfreq: -12.9280 -6.7518 -0.0010 -0.0008 -0.0005 7.0357 18.9487 31.2564 42.6697
frequency: 18.1340 31.0358 42.6603 63.8482 71.3357 83.8373 112.6138 141.4136 143.8369 179.4359 193.4264 203.4101 214.3733 230.0071 233.7058 242.1196 269.5792 290.3247 299.9376 309.8045 327.7502 333.6439 354.5196 369.0789 371.3262 381.7269 401.3997 422.7246 447.5003 459.1787 493.5610 516.0648 522.3032 541.6104 550.9111 555.6970 576.8858 615.4691 649.9866 662.8587 684.7575 693.2427 694.6472 745.0410 764.7437 785.9420 809.5507 813.5351 836.6513 842.2745 854.9348 864.7219 873.6264 874.9842 886.8668 903.6831 929.4347 936.3513 964.9434 968.6501 975.8798 980.2466 981.1078 990.4153 993.3866 998.9663 1009.2125 1042.8830 1048.7185 1065.6467 1074.8577 1090.3795 1104.1185 1110.9227 1114.3527 1134.4595 1136.2702 1146.6540 1160.5302 1161.5144 1182.7720 1190.5161 1212.2606 1221.4895 1227.8876 1247.3820 1251.4632 1253.9898 1257.7568 1283.7020 1290.4536 1296.5945 1305.6544 1308.4086 1315.9919 1329.1066 1330.9172 1340.0692 1351.4014 1357.9162 1365.0389 1367.2789 1373.1258 1379.6427 1383.9941 1428.2531 1433.8201 1435.0544 1436.3278 1457.0389 1462.4359 1465.1832 1470.9576 1471.7818 1475.3723 1480.6958 1487.8784 1496.8643 1502.2738 1544.3119 1582.3063 1628.6593 1658.4048 2968.8668 2980.0110 3005.2760 3016.0473 3017.5456 3020.1255 3022.9272 3024.8357 3037.0035 3069.2238 3077.1985 3079.0609 3082.3105 3089.9229 3094.9384 3098.6052 3121.0664 3129.0909 3134.5015 3141.2926 3141.3577 3143.3695 3155.6911 3162.8848 3182.2307 3207.1866 3562.9532
redmass: 4.0310 4.2110 5.0993 3.6136 3.0347 3.4889 4.0519 3.1813 4.8724 4.5386 3.4566 1.8907 2.1638 1.9202 3.1318 2.7322 2.9928 1.6037 1.4047 3.7038 3.8860 3.1332 2.2184 2.3529 4.0185 1.2474 2.7501 3.4121 4.3068 3.2085 4.4323 5.8701 4.1417 3.7677 4.6573 3.2977 4.3395 4.2510 3.6408 1.8740 3.6299 3.6961 5.6012 2.9593 4.1072 2.2314 1.7245 3.0551 1.6643 3.6725 2.2909 1.9355 3.6718 1.7894 2.8552 2.6700 2.7895 1.9591 1.4270 1.9581 1.2617 1.7588 1.3627 2.6422 3.9048 1.2648 2.5219 2.5635 2.6856 3.3273 2.3348 2.4505 2.1117 1.2539 1.9278 1.5080 1.3883 1.3936 1.3186 1.6387 1.3292 1.8582 1.3990 1.5521 2.1121 1.2525 1.3539 1.5675 3.0914 1.3840 1.3346 1.2964 1.4141 1.5044 1.3789 1.6044 1.4989 1.3673 1.4536 1.3910 1.4160 2.1674 1.3985 1.6255 2.0869 2.4709 1.1729 1.1948 1.5127 2.5124 1.0742 1.0809 1.0857 1.0525 1.0698 1.0685 1.0644 1.0790 3.6401 7.1518 6.7641 6.7908 4.7002 1.0826 1.0323 1.0853 1.0784 1.0494 1.0496 1.0610 1.0604 1.0624 1.0891 1.1052 1.0928 1.0921 1.1040 1.1057 1.0742 1.1067 1.1041 1.0884 1.1009 1.1049 1.0896 1.0961 1.0880 1.0977 1.1144 1.0661
irintensity: 0.3225 0.2908 0.3045 0.4384 0.3279 4.3706 5.3103 0.3776 2.1830 0.9357 5.4184 3.0074 2.2958 1.9529 3.7347 3.6982 5.0974 0.7121 0.2137 0.7341 4.2184 2.7618 2.9567 12.6976 7.4781 126.3665 2.8267 6.9370 1.8128 0.8702 4.1056 4.4615 4.1721 3.3943 15.5958 2.6289 0.1135 8.9113 4.6167 13.7895 5.7922 4.1365 9.1403 11.5209 3.5881 5.8343 23.5037 6.5184 32.7378 1.4465 18.4562 12.9608 9.0126 36.5662 14.9876 12.8657 23.0371 13.8760 0.0573 17.5798 73.6596 3.7930 2.1139 49.7452 43.7094 8.9179 2.3617 1.9458 23.3184 32.1296 20.3767 9.0520 17.4209 0.0288 7.4219 1.9812 10.6627 1.1964 17.6241 1.2374 39.5268 106.1396 7.1317 3.0712 1.2816 2.3319 61.4350 9.1306 137.0731 4.6525 26.4025 8.2001 2.9989 13.5610 1.8659 7.7403 5.1746 3.2648 0.8427 8.4247 3.1492 1.7246 2.4914 7.9125 10.7828 6.1944 18.1966 6.4334 9.5711 30.4070 5.7704 16.6500 34.6754 19.4441 13.1269 29.8959 8.8853 50.3295 118.9880 21.1823 9.8471 113.9967 6.5590 15.9389 60.1690 10.6846 2.4229 0.7407 13.7213 9.5078 11.5456 29.7789 12.9775 31.3091 9.4865 19.4257 5.1732 11.9468 1.5333 2.1850 9.7096 5.7584 14.1604 2.4784 18.6377 11.3039 1.1477 4.2188 11.4185 27.6832
temp: 298.150 k
press: 1.00000 atm
elementType: 8 8 7 7 6 6 6 6 6 6 6 6 6 6 6 6 6 6 6 6 6 6 6 6 6 1 1 1 1 1 1 1 1 1 1 1 1 1 1 1 1 1 1 1 1 1 1 1 1 1 1 1
symmnumber: 1
zpe: 1160892.7 jmol-1
zpe.correction: 0.442161 hartree
zpe.thermalcorrener: 0.464973 hartree
zpe.thermalcorrenthalpy: 0.465918 hartree
zpe.thermalcorrgfe: 0.390306 hartree
zpe.sumelectzpe: -1074.254316 hartree
zpe.sumelectthermal: -1074.231503 hartree
zpe.sumelectthermalent: -1074.230559 hartree
zpe.sumelectthermalfe: -1074.306170 hartree
dipole: -6.3414 2.9084 3.9249
dipole: 8.0048
quadrupole: -90.3747 -120.2476 -132.0197
quadrupole: 13.3728 -3.9780 -4.5032
quadrupole: 23.8393 -6.0336 -17.8057 13.3728 -3.9780 -4.5032
hfenergy: -1074.6964764 hartree
pointgroup: C01 [X(C21H27N2O2)]
dipole: 2.3993938 -1.6386951 1.2149008 debye
polarizability: 265.7391157|16.5870587|271.4778258|29.3642904|21.3349783|199.6095363 unknown
InChI: InChI=1S/C21H27N2O2/c1-4-14-13-23(2)10-8-15(14)11-20(23)21(24)17-7-9-22-19-6-5-16(25-3)12-18(17)19/h4-7,9,12,14-15,20-21,24H,1,8,10-11,13H2,2-3H3
charge 1 multiplicity 1
52 atoms
O  0.741748 1.475153 2.518056
O  -3.237719 -2.901636 -0.417327
N  2.26114 -0.776993 1.256355
N  -3.079816 2.711261 -0.70902
C  1.132302 0.073301 0.572361
C  3.282742 0.7486 -0.594695
C  2.91911 -1.624778 0.139842
C  1.825436 1.172877 -0.279185
C  3.268193 -0.733566 -1.090904
C  3.352308 0.148833 1.853971
C  4.11244 0.866994 0.708537
C  0.056072 0.607545 1.554184
C  1.7273 -1.692996 2.339158
C  4.570258 -1.191167 -1.720261
C  -1.043972 1.32381 0.768522
C  4.683316 -1.668117 -2.983142
C  -2.086953 0.567471 0.11191
C  -1.060351 2.718879 0.670914
C  -3.086043 1.326645 -0.624222
C  -2.194486 -0.854162 0.145694
C  -2.096622 3.371228 -0.071069
C  -4.136616 0.625873 -1.295257
C  -3.239924 -1.512281 -0.523637
C  -4.222058 -0.764692 -1.255404
C  -4.324801 -3.660343 -1.060648
H  0.620377 -0.655121 -0.084731
H  3.708349 1.396256 -1.378274
H  2.219575 -2.437327 -0.119658
H  3.824519 -2.070205 0.588169
H  1.822653 2.130098 0.270165
H  1.244758 1.318649 -1.205278
H  2.468136 -0.830586 -1.849573
H  4.010206 -0.501334 2.455729
H  2.816504 0.847134 2.513167
H  4.242012 1.929367 0.975491
H  5.122155 0.443109 0.574488
H  -0.404369 -0.243599 2.097395
H  1.416895 -1.089228 3.204322
H  0.876916 -2.274276 1.949032
H  2.531044 -2.382488 2.641759
H  5.47164 -1.118217 -1.092021
H  0.072947 1.940051 3.08256
H  5.65096 -1.974639 -3.39355
H  3.816189 -1.762353 -3.649061
H  -0.28478 3.323959 1.151729
H  -1.494007 -1.481338 0.707253
H  -2.113967 4.463943 -0.146728
H  -4.871356 1.227509 -1.83806
H  -5.037842 -1.273708 -1.775555
H  -4.316323 -3.516613 -2.15691
H  -5.3088 -3.375041 -0.64559
H  -4.112595 -4.711841 -0.8223
