program: Gaussian 09
title: 000039474
version: EM64L-G09RevD.01
frameworkgroup: C1[X(C23H31NO2S)]
method: RPBEPBE
basis: SDD
operation: Freq
keyword: #p
keyword: freq=noraman
keyword: PBEPBE/SDD
title: #p freq=noraman PBEPBE/SDD
converged: YES YES NO NO
title: Mulliken charges:
elementType: S O O N C C C C C C C C C C C C C C C C C C C C C C C H H H H H H H H H H H H H H H H H H H H H H H H H H H H H H H
charge: 0.173994 -0.301570 -0.248485 -0.095383 -0.000919 -0.458964 -0.143216 -0.477947 -0.466173 -0.288882 -0.804076 0.428684 0.134409 -0.311104 -0.667800 -0.411082 -0.352856 -0.346517 0.405625 -0.313844 -0.318510 -0.268245 -0.392661 -0.466940 -0.435639 -0.294627 -0.249341 0.237546 0.210600 0.204637 0.264659 0.235038 0.214314 0.228175 0.228821 0.217504 0.195593 0.248490 0.261354 0.199145 0.216387 0.257211 0.282053 0.220323 0.211268 0.191381 0.194897 0.219904 0.212233 0.191835 0.191772 0.213125 0.223089 0.271588 0.237626 0.236325 0.227840 0.227332
chargesum: 0.00000
title: Mulliken charges with hydrogens summed into heavy atoms:
elementType: S O O N C C C C C C C C C C C C C C C C C C C C C C C
charge: 0.173994 -0.301570 -0.248485 -0.095383 0.236627 -0.043726 0.121444 -0.028596 -0.009178 0.124215 -0.294232 0.428684 0.134409 0.104428 -0.128535 -0.190758 0.049793 0.068285 0.405625 0.090224 0.086387 -0.045156 -0.121073 -0.229313 -0.199313 -0.066787 -0.022009
polarizability: 2.68836297e+02 1.16630416e+01 2.69431427e+02 3.51866074e+01 -3.74511566e-01 2.82410478e+02
1716.lowfreq: -12.5443 -7.4314 -2.3520 0.0011 0.0012 0.0015 8.2873 13.9538 15.8884
frequency: -8.1269 11.1995 15.6511 20.3129 24.7485 45.4591 48.0815 61.6585 70.7257 87.3019 90.9864 123.9012 125.7022 147.1122 173.1901 178.6918 191.2250 218.3244 234.9960 241.9685 254.3506 278.6037 290.2908 319.3399 351.7279 375.6142 400.0641 409.8037 422.2010 447.8599 454.2818 468.8079 472.0400 481.6302 492.0406 523.6678 560.0993 583.0257 588.3847 592.5720 631.6455 660.1378 683.6812 691.4862 710.9775 745.2836 760.6209 767.6982 785.1082 788.8825 790.3415 809.4653 814.1094 825.8709 840.7132 848.4002 858.2367 879.4920 893.6197 896.6218 905.0815 916.7731 924.1139 948.1149 964.3259 979.8364 982.6289 990.9257 993.2165 998.5310 1017.9207 1026.8035 1027.4004 1033.9319 1041.1697 1049.7207 1054.0950 1067.9529 1082.0798 1083.8447 1098.8393 1103.3896 1120.4349 1122.1543 1132.7617 1142.4864 1152.0984 1160.5374 1170.1325 1176.4982 1184.4720 1189.3685 1192.9681 1198.5678 1218.9042 1235.0840 1236.9866 1245.2596 1250.0075 1265.0219 1269.6466 1272.0469 1275.8816 1292.9868 1294.1429 1297.6221 1312.6467 1315.0070 1318.0490 1328.2475 1340.4293 1342.4603 1348.6031 1357.7589 1364.7014 1370.7366 1385.5737 1390.5806 1404.8012 1420.3217 1433.7888 1442.4103 1443.7484 1446.2059 1447.3714 1450.6080 1457.4548 1458.6650 1460.3078 1460.8212 1467.0234 1479.3509 1489.9362 1519.7821 1588.6519 1598.9906 1631.2981 2860.6215 2865.8830 2879.4418 2953.7305 2957.6134 2966.2136 2969.1277 2975.5657 2997.1683 3003.3884 3012.3093 3018.5386 3026.7765 3028.5114 3034.6757 3035.8700 3052.6800 3055.0721 3074.2128 3077.9047 3078.8029 3082.7493 3088.3064 3096.2232 3115.9392 3118.0957 3125.7021 3130.3279 3150.3649 3152.5924 3163.4552
redmass: 3.8079 3.6449 5.3427 2.9553 5.1470 3.9450 4.4731 4.3816 4.8982 5.4789 3.1670 4.6721 2.7008 4.7084 4.0801 4.1426 2.3579 3.0146 2.5579 2.1725 3.3563 3.0441 3.6909 2.3497 3.5095 2.5238 2.7049 2.8381 3.2909 5.4190 3.4288 2.7791 3.2723 3.2348 5.4610 5.6760 2.1667 3.1322 3.2960 1.9810 3.4688 3.1614 4.1700 4.5927 5.4676 1.3194 3.4064 2.5511 5.2899 1.8908 1.5597 2.9935 1.6317 4.0046 1.6009 1.9521 1.5649 1.7161 1.6978 2.2207 2.4635 1.4558 2.5381 2.0639 1.3902 3.2612 1.4001 1.6864 1.3990 2.1272 2.9601 3.6852 2.1877 2.3803 2.0627 2.7776 2.1588 3.0542 2.2420 3.0419 2.0970 1.8301 1.8889 2.1323 2.7080 1.4131 1.4589 1.2987 1.3873 1.1614 1.2984 1.0640 1.2170 1.4722 1.3080 1.8367 1.2597 1.4341 1.4469 1.3807 1.2917 1.6540 1.3401 1.2490 1.2898 1.2451 1.3466 1.2049 1.2363 1.2725 1.2805 1.2460 1.7709 1.4013 1.5819 1.2655 1.4290 1.7560 3.2736 2.9959 1.1208 1.0839 1.9211 1.2326 1.0864 1.0958 2.3133 1.0941 1.0905 1.0926 1.0986 1.0926 1.0914 3.4678 7.5157 5.1456 6.2295 1.0704 1.0703 1.0693 1.0663 1.0664 1.0621 1.0639 1.0829 1.0638 1.0583 1.0627 1.0569 1.0898 1.0992 1.0886 1.0892 1.0889 1.0988 1.1001 1.1007 1.0965 1.0978 1.1056 1.1085 1.0855 1.0860 1.0907 1.0892 1.0946 1.0989 1.0985
irintensity: 0.0691 0.3241 0.0479 0.0363 0.5524 0.4774 0.6326 4.7829 1.4328 3.2782 0.8166 0.6842 0.2385 0.7307 4.7322 1.9715 0.7600 2.2200 2.3799 1.6074 2.5017 0.0611 0.6130 10.5762 1.6745 2.8352 3.0751 0.5415 3.4923 3.0423 6.0577 0.8006 1.3672 20.9979 1.7888 1.1526 0.6267 0.8877 1.9254 5.5859 3.1705 1.3180 3.4487 4.0115 4.6846 11.0865 19.2650 6.1430 0.4693 63.4899 6.0537 19.8985 88.6408 3.4571 0.3291 12.2967 0.4207 0.6831 1.6961 14.6856 29.8406 0.8539 9.1898 6.1836 1.1765 9.6135 5.6881 15.1163 1.0280 12.6571 39.4611 47.9920 8.1346 7.1557 11.5617 20.5232 4.2282 4.9290 8.3961 25.2228 17.5040 3.6214 3.2822 33.7568 47.3988 0.7276 2.7161 6.1646 4.4797 2.2901 2.2118 1.8653 4.2347 1.7071 2.2262 1.3997 16.6925 5.6027 5.2942 5.6582 4.1788 3.4684 4.1777 1.9798 25.4419 10.8217 2.4535 3.2728 11.3271 5.1809 3.3674 9.2578 5.5666 1.9207 7.1251 1.8139 0.8341 6.2796 0.3812 5.7848 0.8352 2.3049 0.6437 18.2186 2.3373 14.1264 0.4897 1.2332 11.0423 11.9738 13.3004 8.7055 0.5588 8.5374 2.0961 5.4839 0.4370 53.8954 38.7533 130.0479 32.1101 96.3088 30.6414 88.5431 10.3169 32.1574 44.2263 26.1252 14.2651 26.7581 34.5113 35.6840 32.1017 4.5226 36.8341 18.4915 25.9301 44.5812 32.0739 61.2974 23.3341 5.0374 0.5072 19.1198 18.1663 28.5174 36.7475 17.5908
temp: 298.150 k
press: 1.00000 atm
elementType: 16 8 8 7 6 6 6 6 6 6 6 6 6 6 6 6 6 6 6 6 6 6 6 6 6 6 6 1 1 1 1 1 1 1 1 1 1 1 1 1 1 1 1 1 1 1 1 1 1 1 1 1 1 1 1 1 1 1
symmnumber: 1
zpe: 1294186.0 jmol-1
zpe.correction: 0.492929 hartree
zpe.thermalcorrener: 0.518357 hartree
zpe.thermalcorrenthalpy: 0.519302 hartree
zpe.thermalcorrgfe: 0.433274 hartree
zpe.sumelectzpe: -1496.227223 hartree
zpe.sumelectthermal: -1496.201796 hartree
zpe.sumelectthermalent: -1496.200851 hartree
zpe.sumelectthermalfe: -1496.286879 hartree
dipole: 4.0117 -1.8504 0.1049
dipole: 4.4191
quadrupole: -167.0891 -158.0667 -168.0880
quadrupole: -4.5305 -5.3277 -3.6212
quadrupole: -2.6745 6.3479 -3.6734 -4.5305 -5.3277 -3.6212
hfenergy: -1496.7201529 hartree
pointgroup: C01 [X(C23H31N1O2S1)]
dipole: -1.4656783 0.9347737 0.0283122 debye
polarizability: 270.6421977|9.9109018|266.7803233|-35.0611816|5.5995119|283.2556803 unknown
InChI: InChI=1S/C23H31NO2S/c1-2-8-22-19(5-1)6-3-9-23(22)20(17-21-7-4-13-26-21)18-27-16-12-24-10-14-25-15-11-24/h1-3,5-6,8-9,20-21H,4,7,10-18H2
charge 0 multiplicity 1
58 atoms
S  0.856862 -0.334124 2.953267
O  -1.99524 2.729139 -0.759242
O  6.20989 -0.037725 -1.553319
N  4.200833 0.178963 0.537884
C  -3.095048 2.073584 0.023917
C  -2.562535 1.753885 1.427786
C  -1.347777 0.774725 1.40387
C  -4.278042 3.066095 -0.021979
C  -4.080937 3.782142 -1.382191
C  -2.54532 3.917971 -1.45878
C  -0.645525 0.802887 2.784622
C  -1.759058 -0.635576 0.963252
C  -1.405072 -1.16855 -0.336706
C  3.349577 -0.230618 1.682472
C  1.93676 0.366644 1.559766
C  -2.490097 -1.444017 1.845551
C  5.651538 0.176346 0.859066
C  3.952411 -0.619288 -0.692173
C  -1.757708 -2.543034 -0.657508
C  6.446879 0.744544 -0.328405
C  4.769136 -0.045999 -1.861309
C  -2.86028 -2.781887 1.518597
C  -0.724859 -0.3992 -1.345916
C  -2.486457 -3.329853 0.291812
C  -1.379421 -3.093823 -1.927807
C  -0.376097 -0.963321 -2.575606
C  -0.693061 -2.32707 -2.869446
H  -3.357404 1.136211 -0.507622
H  -3.381891 1.321173 2.036897
H  -2.257682 2.707887 1.903633
H  -0.635991 1.196443 0.675268
H  -5.252444 2.554606 0.055289
H  -4.199184 3.792572 0.809949
H  -4.4545 3.14679 -2.205673
H  -4.595329 4.757116 -1.433259
H  -2.154529 3.914991 -2.491346
H  -2.195445 4.834764 -0.941455
H  -1.318275 0.47451 3.596912
H  -0.31476 1.833068 3.010428
H  3.282122 -1.343536 1.774815
H  3.814787 0.142231 2.613851
H  1.975104 1.464943 1.656931
H  1.473127 0.099518 0.596094
H  -2.766872 -1.052889 2.832121
H  5.824765 0.807699 1.75115
H  6.024713 -0.854552 1.085722
H  4.233574 -1.692116 -0.539336
H  2.877483 -0.586352 -0.948885
H  7.532898 0.685581 -0.146226
H  6.151214 1.802775 -0.497153
H  4.427536 0.989159 -2.078625
H  4.664921 -0.670548 -2.763988
H  -3.423386 -3.379469 2.243982
H  -0.518521 0.662057 -1.175099
H  -2.746152 -4.364484 0.03761
H  -1.646723 -4.134824 -2.147131
H  0.131706 -0.3510 -3.329408
H  -0.409114 -2.757865 -3.836022
