program: Gaussian 09
title: 000005635
version: EM64L-G09RevD.01
frameworkgroup: C1[X(C18H19NO5)]
method: RPBEPBE
basis: SDD
operation: Freq
keyword: #p
keyword: freq=noraman
keyword: PBEPBE/SDD
title: #p freq=noraman PBEPBE/SDD
converged: YES YES NO NO
title: Mulliken charges:
elementType: O O O O O N C C C C C C C C C C C C C C C C C C H H H H H H H H H H H H H H H H H H H
charge: -0.219908 -0.241996 -0.258117 -0.255295 -0.226935 -0.124717 -0.152800 -0.404123 -0.146319 0.403098 -0.054680 -0.568340 -0.396156 0.525410 -0.433641 0.069310 -0.660136 -0.594182 0.099982 -0.494988 0.200254 0.181093 -0.520250 -0.204732 0.240817 0.262300 0.253391 0.178023 0.238598 0.231682 0.232662 0.189937 0.239533 0.195720 0.255408 0.225576 0.285849 0.298774 0.235378 0.188533 0.239375 0.246133 0.240480
chargesum: 0.00000
title: Mulliken charges with hydrogens summed into heavy atoms:
elementType: O O O O O N C C C C C C C C C C C C C C C C C C
charge: -0.219908 -0.241996 -0.258117 -0.255295 -0.226935 -0.124717 0.088016 -0.141823 0.107071 0.403098 0.123343 -0.098060 0.026444 0.525410 -0.194108 0.069310 0.016568 -0.308333 0.099982 -0.196214 0.200254 0.181093 0.143036 0.281880
polarizability: 2.80504061e+02 9.67311593e+00 2.07774935e+02 1.41909987e+00 -1.35292250e+01 1.61334061e+02
1716.lowfreq: -5.9003 -5.0219 -0.0004 0.0005 0.0006 4.6413 25.5989 46.2349 57.0488
frequency: 25.4366 46.2165 57.0312 69.8870 85.1433 105.9267 112.8955 132.4872 134.9185 166.0627 185.0648 190.0775 214.2643 233.3697 234.4931 244.3046 260.9137 269.8067 301.6493 335.0863 344.0822 366.3660 399.6961 411.9884 424.9177 443.1585 486.7275 500.2556 539.4867 551.3660 576.2635 594.3652 626.9150 635.3569 666.9975 682.4301 700.8962 707.4186 753.8234 764.5009 771.7226 795.1268 806.2676 835.8999 854.8704 866.6950 881.3696 895.6838 910.3410 911.0226 923.9372 946.3049 963.8453 975.1375 989.3417 1020.0635 1035.5208 1043.7609 1052.3161 1053.8702 1067.9462 1082.4806 1110.3367 1111.3187 1122.9514 1126.7480 1136.9444 1156.1635 1158.3473 1162.8915 1174.1879 1180.1446 1183.4233 1212.2634 1228.3292 1236.2122 1251.0247 1260.0166 1271.4152 1277.1404 1300.5407 1316.8466 1323.4898 1335.5993 1342.9496 1352.0949 1361.8742 1366.3442 1415.9590 1429.7674 1430.2962 1434.1554 1451.1145 1454.8787 1466.8374 1469.7652 1479.6733 1482.8557 1487.1198 1491.8833 1605.9253 1615.1707 1640.0128 1719.1089 2836.5874 2847.4760 2862.9414 2872.3707 2928.4383 2986.0063 3004.3243 3014.4808 3027.2979 3027.9668 3037.1621 3041.8756 3062.2112 3106.4003 3109.3949 3110.0831 3130.2346 3171.2662 3185.7392
redmass: 3.9209 3.8306 5.4154 2.7020 3.4931 7.8479 2.9951 2.1012 3.6424 5.7571 4.1843 2.2071 1.3191 1.8637 3.5611 4.1453 5.8950 3.9001 3.8134 4.3414 8.0039 5.8025 3.3969 3.2792 3.7471 5.5508 4.9919 4.6791 6.3424 4.3273 5.2683 5.2137 4.2354 6.1096 5.9851 8.8262 6.6642 6.0641 5.4817 4.4484 5.3547 2.0895 2.6409 9.2078 3.5257 3.6005 1.7155 1.9124 3.2930 1.4620 3.1741 2.7696 5.5002 4.7182 2.6663 3.2613 2.0898 3.7809 2.8459 3.5576 1.4695 2.8980 1.2972 1.4194 1.0572 1.7113 2.4802 1.7234 1.5536 1.9560 2.4140 1.5124 2.5154 1.3749 1.5820 1.6216 1.5319 1.9277 1.5562 1.8663 1.4132 1.3741 1.8899 1.4754 1.4037 1.4889 1.3056 1.5008 5.6601 2.8294 1.1446 1.4412 1.0840 1.0572 1.1313 2.1846 1.0481 1.0515 1.3233 1.0890 9.4167 8.5985 11.7539 9.2534 1.0787 1.0795 1.0638 1.0646 1.0394 1.0855 1.0614 1.0574 1.0845 1.0950 1.0771 1.0887 1.1024 1.0988 1.1144 1.0968 1.0919 1.0934 1.0936
irintensity: 0.4625 2.1337 0.4858 10.5449 3.3235 5.6131 3.9039 2.1862 2.6368 2.8141 2.2817 0.5755 0.9635 2.1788 0.5449 4.8598 0.4370 3.6377 1.2451 0.4353 3.7859 1.1990 1.4589 2.3007 3.9377 4.1409 8.0932 11.7248 5.4113 6.6885 0.9688 7.5167 1.0617 9.6331 3.0897 0.3874 5.0478 19.9027 3.1276 3.4900 12.0774 9.3414 18.4891 22.8709 13.9784 14.6747 9.2726 45.7928 14.9408 27.5979 2.9918 13.7734 143.5144 101.7711 7.7602 50.0145 18.4064 88.3001 93.3373 64.5100 6.6213 2.2729 4.8958 4.2854 1.2887 3.5730 15.0104 11.7088 10.3637 21.3841 73.5599 9.4625 39.4516 4.6764 7.6046 9.1572 6.8370 195.8743 36.3354 142.0717 27.6458 2.8987 28.1214 0.3659 11.0493 3.8278 1.1330 20.8020 0.5420 12.3011 3.7679 4.5676 9.8557 8.7951 8.8958 193.3657 11.2641 9.8485 39.4616 6.0316 35.1011 73.8658 236.9757 12.7438 22.0514 55.6743 24.5327 175.9770 80.0988 40.8389 21.9584 120.0167 18.3835 40.3232 27.3326 59.3635 23.1617 31.6725 31.1719 11.8967 15.3826 0.5558 4.9224
temp: 298.150 k
press: 1.00000 atm
elementType: 8 8 8 8 8 7 6 6 6 6 6 6 6 6 6 6 6 6 6 6 6 6 6 6 1 1 1 1 1 1 1 1 1 1 1 1 1 1 1 1 1 1 1
symmnumber: 1
zpe: 889794.1 jmol-1
zpe.correction: 0.338905 hartree
zpe.thermalcorrener: 0.359737 hartree
zpe.thermalcorrenthalpy: 0.360681 hartree
zpe.thermalcorrgfe: 0.289284 hartree
zpe.sumelectzpe: -1126.354119 hartree
zpe.sumelectthermal: -1126.333286 hartree
zpe.sumelectthermalent: -1126.332342 hartree
zpe.sumelectthermalfe: -1126.403739 hartree
dipole: 2.5281 3.2582 -4.1847
dipole: 5.8753
quadrupole: -125.7600 -136.6453 -146.7870
quadrupole: -2.0360 3.5129 15.8131
quadrupole: 10.6374 -0.2479 -10.3895 -2.0360 3.5129 15.8131
hfenergy: -1126.6930234 hartree
pointgroup: C01 [X(C18H19N1O5)]
dipole: 0.8971714 1.3909353 -1.6135277 debye
polarizability: 278.6364662|14.9688047|210.2324517|2.9075777|-12.2310324|160.7441386 unknown
InChI: InChI=1S/C18H19NO5/c1-19-4-3-9-5-14(21-2)17-15(16(9)19)10-6-12-13(23-8-22-12)7-11(10)18(20)24-17/h5-7,14-17H,3-4,8H2,1-2H3
charge 0 multiplicity 1
43 atoms
O  -1.152103 -1.73208 0.700068
O  -3.579448 -2.331849 -0.507172
O  4.274007 1.138212 -1.390691
O  4.904374 -0.43428 0.310067
O  0.355767 -2.329739 2.316075
N  -1.12317 2.609724 0.210487
C  -1.45603 1.155034 0.251617
C  -0.68173 0.231669 -0.743845
C  -1.318384 -1.179515 -0.681278
C  -2.943158 1.131661 -0.092847
C  -2.827145 -1.195243 -1.047964
C  -3.532625 2.512279 0.168355
C  -2.336788 3.306291 0.742614
C  0.801176 0.050845 -0.462476
C  -3.559232 0.062944 -0.646415
C  1.176974 -0.895977 0.534487
C  0.089454 3.008122 0.954385
C  1.794581 0.785157 -1.164433
C  0.143626 -1.695845 1.25958
C  2.544584 -1.11629 0.880949
C  3.127233 0.54951 -0.820184
C  3.494033 -0.377086 0.185766
C  -3.067756 -3.635475 -0.940412
C  5.425344 0.624939 -0.590263
H  -1.310396 0.750372 1.287117
H  -0.829154 0.655787 -1.754994
H  -0.763645 -1.858348 -1.360608
H  -2.852347 -1.270803 -2.166021
H  -3.887954 2.958069 -0.778421
H  -4.387743 2.488529 0.867146
H  -2.328611 4.367796 0.439059
H  -2.358497 3.268819 1.860789
H  -4.627613 0.083952 -0.893189
H  0.041221 2.722151 2.035566
H  0.988431 2.548806 0.518249
H  0.204862 4.105212 0.895314
H  1.52243 1.51092 -1.935095
H  2.802327 -1.83895 1.658601
H  -3.814709 -4.372698 -0.60718
H  -2.967181 -3.686151 -2.047333
H  -2.094958 -3.863762 -0.464511
H  6.166709 0.185331 -1.275495
H  5.831243 1.453757 0.017338
