program: Gaussian 09
title: 000005594
version: EM64L-G09RevD.01
frameworkgroup: C1[X(C16H18Cl2O2)]
method: RPBEPBE
basis: SDD
operation: Freq
keyword: #p
keyword: freq=noraman
keyword: PBEPBE/SDD
title: #p freq=noraman PBEPBE/SDD
converged: YES YES NO NO
title: Mulliken charges:
elementType: Cl Cl O O C C C C C C C C C C C C C C C C H H H H H H H H H H H H H H H H H H
charge: -0.045021 -0.039648 -0.305139 -0.248166 -0.124064 -0.118575 -0.027563 -0.495818 -0.491236 -0.517310 -0.534460 0.030481 -0.780674 0.199357 0.245886 -0.329394 -0.326434 -0.059017 -0.066284 -0.212968 0.220942 0.221886 0.210856 0.217694 0.231643 0.230576 0.209788 0.246026 0.211637 0.215638 0.224684 0.259395 0.215948 0.216726 0.228934 0.299262 0.298550 0.285864
chargesum: 0.00000
title: Mulliken charges with hydrogens summed into heavy atoms:
elementType: Cl Cl O O C C C C C C C C C C C C C C C C
charge: -0.045021 -0.039648 -0.305139 -0.248166 0.096878 0.103311 0.183292 -0.046481 -0.050872 -0.059648 -0.094138 0.289876 -0.119066 0.199357 0.245886 -0.030132 -0.027884 -0.059017 -0.066284 0.072897
polarizability: 2.65939400e+02 -6.01935282e+00 2.05583331e+02 -3.50519772e+00 5.08899499e-01 1.18935956e+02
1716.lowfreq: -15.4651 -3.6154 -0.0025 -0.0021 -0.0018 7.4701 11.7942 37.5143 38.6355
frequency: 3.7356 36.7491 38.6170 61.6253 93.2727 122.1632 144.4837 181.8381 182.1598 193.9002 201.5629 204.3954 205.4258 252.6176 259.0354 318.3366 335.7992 341.0813 362.2392 384.5179 408.2440 422.0628 434.1654 475.1808 491.9727 516.3917 517.3197 605.7763 655.1267 696.7419 711.4674 730.4019 733.9884 752.8966 766.0020 795.7395 813.3979 843.4793 864.7468 875.4489 881.9573 907.5318 916.9340 927.4857 934.9057 937.1652 972.1379 981.2243 991.9299 1023.2870 1027.5096 1040.5506 1059.5856 1070.4250 1081.9075 1096.4271 1108.2249 1122.2919 1131.4556 1154.1927 1159.1915 1197.2449 1203.4990 1230.5267 1241.4571 1245.6657 1251.8593 1260.8226 1273.9204 1288.6662 1295.6271 1311.9831 1321.2443 1327.6647 1347.6322 1356.1596 1370.7542 1380.5526 1389.7953 1406.7646 1424.9853 1464.6586 1471.4922 1473.9298 1476.6140 1486.8936 1495.8733 1562.6729 1594.3971 1612.9275 2973.8125 2981.6292 2985.9868 2989.5046 2997.2581 3007.5808 3017.0915 3027.8072 3030.6744 3046.1004 3050.3588 3060.3230 3064.2445 3069.8141 3074.7878 3177.5602 3184.2973 3195.4098
redmass: 4.6642 6.1270 5.6117 7.4536 5.3973 10.3714 8.7294 5.3969 1.5960 2.6672 7.2852 3.0258 2.0084 3.1993 2.4383 2.8631 14.0033 2.6571 3.4616 5.7653 7.6318 4.9136 2.4661 3.8323 4.6856 4.0780 5.2916 3.1717 3.1720 7.9631 4.3610 4.3567 3.6935 10.5294 2.3325 1.7022 2.2760 5.8172 2.4864 1.4589 1.5142 3.1255 1.4176 1.4390 4.6896 1.7434 2.5691 6.1745 1.9320 1.4562 1.4755 1.8674 1.3144 2.2186 2.1939 1.5053 3.3315 1.0881 2.2219 1.1593 2.4865 1.4895 1.5686 3.7601 1.5712 1.1866 1.3847 1.4739 1.4538 1.4082 1.4724 1.2412 1.4740 1.4085 1.5900 1.4744 1.4688 11.1750 1.2099 2.9807 3.5027 1.0854 1.0644 1.0733 1.0681 1.0625 1.0869 7.8474 7.6163 11.6374 1.0378 1.0814 1.0608 1.0628 1.0604 1.0666 1.0846 1.0871 1.0855 1.1029 1.1021 1.1004 1.0989 1.1012 1.1008 1.0930 1.0940 1.0934
irintensity: 0.0271 0.2788 0.1522 0.7659 0.2036 0.8264 0.8425 1.0803 0.0457 0.5141 1.8213 0.1507 0.0141 4.1987 0.0648 2.0521 2.2630 1.1345 2.1490 12.4859 4.1278 2.2661 5.1326 1.3504 5.1118 3.1979 0.2412 3.9714 9.4113 14.1090 0.2354 23.4277 6.3992 104.2389 1.7861 10.7724 7.0109 29.1578 1.4022 25.9781 0.5948 13.6145 7.4384 13.2305 135.4780 1.5252 7.1035 2.9556 1.3886 15.0230 11.6003 14.4475 9.3367 20.3646 80.7301 13.0606 85.1197 0.6397 4.8241 2.5039 4.1331 6.0646 1.7362 587.9356 1.9202 0.5757 15.9507 1.4172 3.6029 0.7114 0.4220 17.6595 1.7726 0.8210 1.9893 1.6367 3.8586 1.8665 13.5805 71.2735 13.8850 4.0711 15.1646 2.1637 14.5048 0.1261 23.0782 164.3869 17.4854 98.2040 43.2426 19.5431 16.7379 32.4545 7.4250 56.7422 97.1161 18.4322 0.2663 9.1993 13.7173 25.8751 37.2441 85.8066 52.4855 4.9498 1.0918 3.1216
temp: 298.150 k
press: 1.00000 atm
elementType: 17 17 8 8 6 6 6 6 6 6 6 6 6 6 6 6 6 6 6 6 1 1 1 1 1 1 1 1 1 1 1 1 1 1 1 1 1 1
symmnumber: 1
zpe: 797077.5 jmol-1
zpe.correction: 0.303591 hartree
zpe.thermalcorrener: 0.322182 hartree
zpe.thermalcorrenthalpy: 0.323126 hartree
zpe.thermalcorrgfe: 0.253541 hartree
zpe.sumelectzpe: -1689.601039 hartree
zpe.sumelectthermal: -1689.582448 hartree
zpe.sumelectthermalent: -1689.581504 hartree
zpe.sumelectthermalfe: -1689.651089 hartree
dipole: -2.9736 1.3445 -0.0786
dipole: 3.2644
quadrupole: -125.2310 -140.0595 -132.0239
quadrupole: 0.2167 -0.1871 0.3573
quadrupole: 7.2071 -7.6214 0.4142 0.2167 -0.1871 0.3573
hfenergy: -1689.90463 hartree
pointgroup: C01 [X(C16H18Cl2O2)]
dipole: -1.1688623 0.5301445 -0.046078 debye
polarizability: 265.9439824|-6.1810156|205.5890061|-2.8055865|-1.2394572|118.9256984 unknown
InChI: InChI=1S/C16H18Cl2O2/c1-9-10-2-3-11(9)7-15(6-10)20-16(19)12-4-13(17)8-14(18)5-12/h4-5,8-11,15H,2-3,6-7H2,1H3
charge 0 multiplicity 1
38 atoms
Cl 4.216112 3.253072 -0.086524
Cl 5.938325 -2.023646 -0.076505
O  -0.121631 0.198455 0.274362
O  0.501568 -2.054284 0.263722
C  -3.653511 -0.470132 -1.109242
C  -3.842936 0.812545 0.892935
C  -4.190655 0.909551 -0.623532
C  -4.21812 -1.46423 -0.041864
C  -4.343038 -0.61835 1.277397
C  -2.099074 -0.437003 -1.096744
C  -2.303197 0.951361 1.06646
C  -1.57566 -0.190106 0.335093
C  -5.691921 1.123707 -0.903188
C  0.805433 -0.835489 0.226495
C  2.209344 -0.320006 0.128712
C  3.256583 -1.274777 0.082245
C  2.490043 1.068953 0.07814
C  3.831725 1.475074 -0.018913
C  4.579827 -0.815628 -0.014718
C  4.900094 0.556628 -0.067533
H  -4.001887 -0.719904 -2.128671
H  -4.345648 1.597254 1.488408
H  -3.623836 1.7356 -1.099197
H  -3.558763 -2.342571 0.081976
H  -5.205245 -1.84863 -0.354818
H  -5.392326 -0.580944 1.620412
H  -3.751763 -1.04574 2.108145
H  -1.683078 -1.387568 -1.478516
H  -1.742701 0.378236 -1.756558
H  -1.969687 1.921551 0.649681
H  -2.024905 0.937761 2.13711
H  -1.627752 -1.129667 0.914209
H  -6.037072 2.089681 -0.48918
H  -5.892667 1.132784 -1.990978
H  -6.314286 0.327243 -0.456146
H  3.012607 -2.339938 0.121855
H  1.673747 1.792847 0.114475
H  5.93615 0.895111 -0.143705
