program: Gaussian 09
title: 000005588
version: EM64L-G09RevD.01
frameworkgroup: C1[X(C19H22N2)]
method: RPBEPBE
basis: SDD
operation: Freq
keyword: #pfreq=noraman
keyword: PBEPBE/SDD
title: #p freq=noraman PBEPBE/SDD
converged: YES YES NO NO
title: Mulliken charges:
elementType: N N C C C C C C C C C C C C C C C C C C C H H H H H H H H H H H H H H H H H H H H H H
charge: -0.095631 -0.049330 -0.374762 -0.338219 -0.436632 -0.449460 -0.428146 -0.349615 0.253630 0.302674 0.009408 -0.384113 -0.405157 -0.308017 0.442759 -0.395947 -0.404590 -0.207254 -0.812673 -0.378693 -0.176361 0.224302 0.173810 0.178680 0.238375 0.226365 0.207827 0.205136 0.226731 0.213142 0.206984 0.259345 0.292395 0.239420 0.250631 0.224924 0.225345 0.238996 0.224181 0.234017 0.222157 0.241793 0.231572
chargesum: 0.00000
title: Mulliken charges with hydrogens summed into heavy atoms:
elementType: N N C C C C C C C C C C C C C C C C C C C
charge: -0.095631 -0.049330 0.023351 0.078836 -0.002440 -0.017593 -0.008019 -0.090270 0.253630 0.302674 0.009408 -0.091718 -0.165737 -0.057386 0.442759 -0.171023 -0.179244 0.031742 -0.132318 -0.136900 0.055211
polarizability: 2.63919540e+02 -2.13874427e+01 2.31418422e+02 2.72118953e+01 1.77859055e+01 1.74949697e+02
1716.lowfreq: -19.8988 -6.0863 -4.6822 -0.0007 -0.0006 -0.0002 3.5917 22.8243 29.5559
frequency: -19.7309 22.6668 29.5099 39.3416 42.9216 48.4595 64.3264 80.0724 102.9034 116.6623 161.1914 208.0993 215.7669 241.1290 258.3453 285.9043 311.9243 335.1993 364.1913 401.4420 409.8396 427.8190 436.3053 496.0998 563.0703 579.2679 604.1728 621.2366 631.1578 635.3136 659.7134 717.5091 726.6472 751.0331 755.0517 782.3861 793.8598 830.5139 841.9095 854.5957 859.2486 866.5577 894.8607 899.2895 910.0069 943.2250 956.1526 958.6565 961.9913 968.2905 985.4008 992.6110 998.7938 999.7590 1015.2516 1039.9971 1045.8431 1058.3454 1083.9858 1092.4219 1096.8802 1121.2006 1126.3789 1132.6939 1163.9447 1174.7916 1183.5869 1189.4424 1198.7667 1220.7993 1223.8171 1226.1970 1243.9825 1267.6670 1277.0054 1284.5138 1290.6154 1298.7574 1308.6727 1317.0742 1338.5696 1340.6532 1361.0490 1374.7418 1395.8446 1406.7707 1407.6280 1452.1271 1457.2957 1464.5005 1470.5796 1472.6061 1478.1288 1480.1382 1493.8286 1503.6174 1555.9206 1568.4406 1576.2512 1620.4591 1634.3624 2833.7850 2846.9537 2864.6278 2962.8192 2971.9051 3010.7485 3022.3473 3031.8794 3052.6276 3053.2261 3066.6657 3082.2934 3091.8631 3107.5218 3113.3982 3117.2103 3123.7771 3136.5622 3140.2916 3156.5915 3158.8681 3170.3719
redmass: 1.0192 4.1618 4.1119 2.2586 3.5327 3.5380 2.1272 4.1051 3.9911 3.7237 3.9108 2.6814 4.1943 5.2161 3.4556 3.5915 4.0721 2.1270 3.0017 3.3866 2.9524 3.9223 3.6246 2.9879 3.6561 4.1900 4.4980 4.0502 5.5134 3.2518 4.7750 3.5799 3.1070 1.6732 1.5465 2.9559 3.0018 1.5523 1.7663 1.4907 1.3866 1.9574 2.6668 1.5394 2.4125 2.0152 1.3928 1.5798 4.6252 1.5815 1.4075 1.3490 1.3355 1.8834 2.8542 2.5011 1.5602 2.6750 1.7297 1.6461 2.5656 2.6398 1.4326 2.3632 1.0907 2.4060 1.2393 1.3595 1.1807 1.2093 2.8313 1.7107 1.4715 1.7192 1.5769 1.2053 1.3519 4.0549 1.4076 1.4591 1.5564 1.9548 2.4197 1.8892 1.2268 1.8867 3.0756 2.2935 1.0976 1.0818 1.1015 1.0545 1.0867 1.0799 1.1064 2.6691 5.5344 5.7680 5.7218 6.3720 8.2255 1.0714 1.0718 1.0670 1.0883 1.0387 1.0599 1.0698 1.0804 1.0946 1.0891 1.1044 1.0997 1.1053 1.0887 1.0875 1.0896 1.0883 1.0889 1.0956 1.0943 1.0949 1.1015
irintensity: 0.5302 0.5470 0.7614 0.3082 0.3557 2.1592 0.4407 0.4634 0.9035 0.7119 3.2644 1.4706 1.7364 1.1592 1.5058 0.3270 1.8351 10.4258 0.7304 5.1195 0.2885 1.4648 0.8827 8.5855 8.0578 16.0423 4.5791 4.3249 0.1042 0.4668 1.2113 4.7792 2.4047 30.9378 8.8059 5.1651 8.7015 62.8457 9.3829 7.5070 11.5375 4.8804 6.4229 2.8917 6.8497 12.8199 0.2836 0.1835 4.2867 2.6075 0.8420 3.5126 0.0730 16.9741 1.8988 5.7792 20.0625 4.9144 5.0413 1.0764 5.0618 17.2119 3.6163 58.7421 1.5825 12.1217 1.2416 5.4408 6.6842 3.0348 0.6480 10.2315 4.5434 6.3432 4.5690 5.1743 4.5454 1.1638 5.7276 10.1251 3.5821 13.3367 1.4180 19.4426 7.7054 15.0235 1.1265 43.4370 5.0298 1.8566 11.8060 12.4288 12.5947 2.0988 3.7903 53.8582 13.4595 2.8742 39.7083 2.7562 1.8661 66.2817 65.2315 136.4404 26.3969 48.0402 20.6912 68.3317 74.0046 24.9251 16.1910 2.3376 18.1166 70.2587 23.7693 10.6235 25.8044 16.2850 7.7039 16.8600 25.9352 9.9802 20.2771
temp: 298.150 k
press: 1.00000 atm
elementType: 7 7 6 6 6 6 6 6 6 6 6 6 6 6 6 6 6 6 6 6 6 1 1 1 1 1 1 1 1 1 1 1 1 1 1 1 1 1 1 1 1 1 1
symmnumber: 1
zpe: 946813.7 jmol-1
zpe.correction: 0.360622 hartree
zpe.thermalcorrener: 0.379540 hartree
zpe.thermalcorrenthalpy: 0.380485 hartree
zpe.thermalcorrgfe: 0.310307 hartree
zpe.sumelectzpe: -845.165264 hartree
zpe.sumelectthermal: -845.146346 hartree
zpe.sumelectthermalent: -845.145401 hartree
zpe.sumelectthermalfe: -845.215579 hartree
dipole: -1.3775 1.8027 -1.0270
dipole: 2.4904
quadrupole: -115.6793 -112.0853 -121.0418
quadrupole: -6.1524 2.6806 0.3399
quadrupole: 0.5895 4.1835 -4.7730 -6.1524 2.6806 0.3399
hfenergy: -845.5258862 hartree
pointgroup: C01 [X(C19H22N2)]
dipole: -0.5703441 -0.7209993 0.3389189 debye
polarizability: 263.4232574|24.1929393|221.5368207|-28.2101755|25.149459|185.3275807 unknown
InChI: InChI=1S/C19H22N2/c1-16-7-9-17(10-8-16)18(19-6-2-3-12-20-19)11-15-21-13-4-5-14-21/h2-3,6-12H,4-5,13-15H2,1H3
charge 0 multiplicity 1
43 atoms
N  -2.913687 1.407329 0.735853
N  0.248461 -2.023222 -1.447577
C  -4.332625 1.287861 1.159412
C  -2.973716 1.694957 -0.721971
C  -5.046036 2.434519 0.39176
C  -4.109343 2.742174 -0.828118
C  -2.061963 0.257796 1.111586
C  -0.603733 0.562147 0.841814
C  0.345257 -0.243234 0.267695
C  1.74696 0.260782 0.086082
C  0.016255 -1.650975 -0.144593
C  2.531768 -0.064124 -1.054599
C  2.33495 1.097586 1.076689
C  -0.515039 -2.56948 0.803426
C  4.417809 1.297086 -0.224346
C  3.838234 0.447592 -1.20118
C  3.640883 1.606053 0.921683
C  -0.818906 -3.888464 0.404157
C  5.813842 1.867769 -0.404855
C  -0.05551 -3.299384 -1.819297
C  -0.590064 -4.266333 -0.938359
H  -4.420921 1.378657 2.257289
H  -4.768988 0.299155 0.860332
H  -3.232865 0.775134 -1.307974
H  -1.999652 2.060877 -1.088926
H  -5.148447 3.327463 1.031557
H  -6.059344 2.13142 0.074979
H  -4.636609 2.669709 -1.795282
H  -3.695979 3.761635 -0.744643
H  -2.377856 -0.68328 0.59499
H  -2.20716 0.088275 2.200267
H  -0.321299 1.590108 1.109073
H  2.094707 -0.705624 -1.825081
H  1.774459 1.324552 1.990985
H  -0.65724 -2.250037 1.840371
H  4.41741 0.185159 -2.095685
H  4.069206 2.240265 1.708072
H  -1.221725 -4.606353 1.126774
H  6.464463 1.17693 -0.970065
H  5.784163 2.822541 -0.966026
H  6.296546 2.074414 0.566844
H  0.142692 -3.547778 -2.868784
H  -0.811357 -5.27736 -1.294428
