program: Gaussian 09
title: 000039316
version: EM64L-G09RevD.01
frameworkgroup: C1[X(C19H19NO2)]
method: RPBEPBE
basis: SDD
operation: Freq
keyword: #p
keyword: freq=noraman
keyword: PBEPBE/SDD
title: #p freq=noraman PBEPBE/SDD
converged: YES YES NO NO
title: Mulliken charges:
elementType: O O N C C C C C C C C C C C C C C C C C C C H H H H H H H H H H H H H H H H H H H
charge: -0.410100 -0.174715 -0.254941 -0.351530 -0.347295 -0.403036 -0.403683 -0.396681 -0.498705 0.345694 0.194033 0.348675 -0.639831 0.115093 0.245903 -0.556833 0.231827 -0.325281 -0.392653 -0.428156 -0.226939 -0.235175 0.206001 0.251082 0.228133 0.201066 0.210025 0.220520 0.215789 0.206985 0.224406 0.193951 0.231079 0.243794 0.276854 0.266455 0.246830 0.277868 0.227804 0.403505 0.232185
chargesum: 0.00000
title: Mulliken charges with hydrogens summed into heavy atoms:
elementType: O O N C C C C C C C C C C C C C C C C C C C
charge: -0.006595 -0.174715 -0.254941 0.105553 0.081903 0.027509 0.019092 0.021675 -0.023832 0.345694 0.194033 0.348675 -0.362977 0.115093 0.245903 -0.290378 0.231827 -0.325281 -0.145823 -0.150288 0.000865 -0.002990
polarizability: 3.72711322e+02 -3.90305267e+00 2.16786179e+02 2.43903729e+01 7.07507325e+00 1.24402290e+02
1716.lowfreq: -6.5178 -2.0701 -0.0010 -0.0006 -0.0003 8.6277 31.0848 48.7985 68.8140
frequency: 30.9438 48.7539 68.6862 86.1499 114.4004 139.2541 145.7003 193.0850 198.3074 213.8023 245.7241 256.1595 279.2307 309.4021 335.8382 345.8280 376.9769 410.1114 421.1663 439.2587 443.4029 455.7766 470.1481 489.5153 525.0188 554.2647 586.3004 610.0386 634.6997 642.6030 704.3693 714.7691 725.1592 752.1197 765.6724 766.2516 785.8318 805.1270 832.8048 851.1021 858.7471 878.7610 891.5744 902.2374 905.1427 931.2259 955.8461 966.3516 968.4632 982.4579 993.7720 994.5261 1021.8157 1047.9587 1070.5694 1071.4990 1087.1349 1110.1829 1114.3896 1140.4486 1146.1064 1162.6200 1170.5474 1179.8997 1188.5224 1203.2557 1220.9819 1229.4709 1261.7722 1266.5252 1269.6800 1288.3637 1300.5020 1309.5412 1322.2025 1335.2297 1346.1558 1350.3167 1355.8834 1361.6196 1370.9922 1407.1504 1420.0028 1446.8689 1451.4994 1458.4331 1460.7214 1463.8462 1469.6273 1470.3874 1477.6400 1493.5494 1528.2626 1591.2314 1600.5336 1603.2107 1619.9412 1634.8956 2081.3646 2914.7491 2923.9157 2946.3485 2974.9647 2988.8288 2991.5430 3003.4853 3037.5072 3043.9992 3051.6373 3054.8278 3061.1013 3125.7763 3126.9418 3139.0520 3150.3880 3157.8675 3165.0535
redmass: 5.0407 4.3208 3.2260 4.3763 5.2695 4.6330 6.8336 4.5923 3.4446 3.3337 2.6960 3.8679 5.7610 2.3079 2.0992 4.8844 4.6154 4.5281 3.2560 2.8624 3.0953 2.6594 3.2251 4.2012 5.9219 2.6164 4.1909 5.8515 5.9114 5.2171 4.5440 4.7551 6.5027 1.6973 3.1586 3.6985 2.5369 1.4771 2.8628 2.8389 1.4325 4.7583 1.5274 1.6761 2.4480 1.5977 1.3186 1.4862 3.4703 2.4591 1.7973 1.6530 1.9263 2.2607 1.8671 2.4412 2.4520 2.2954 2.4358 1.1921 2.0762 1.7766 1.8380 1.9782 1.5137 2.6674 1.3102 1.3736 1.5119 1.2617 1.3694 1.2160 1.7532 1.7898 1.5002 1.3800 1.4204 2.0529 1.4929 1.5109 2.1215 3.8583 2.9511 2.4181 1.3059 2.1228 1.0939 1.1150 1.0987 1.0850 1.1219 5.9678 1.7642 9.0157 4.8307 4.0979 6.8926 8.8257 1.0762 1.0684 1.0685 1.0596 1.0641 1.0619 1.0618 1.1019 1.0928 1.0958 1.1011 1.0946 1.1033 1.0921 1.0857 1.0900 1.0946 1.0925 1.1002
irintensity: 0.8306 2.0192 1.4068 2.8404 1.9058 3.4709 1.9533 1.3706 1.0819 11.5492 0.5351 1.2260 2.4341 2.7082 25.3436 0.4085 4.2313 11.8496 5.4468 19.9855 19.6523 40.8904 12.1119 3.3906 16.8727 8.7149 2.8203 27.3960 3.2731 1.5404 8.5358 7.4046 1.3850 75.5309 45.9136 40.4106 31.1547 4.5320 0.8095 29.6964 3.9367 30.3745 19.7493 1.7731 15.0982 15.8618 10.1386 6.1524 10.4880 76.9366 3.5414 4.0765 1.8174 33.1645 6.3303 0.3408 7.1591 108.2974 2.3456 15.1608 28.7990 51.7830 7.2133 4.9569 25.0531 67.5833 21.8291 14.0846 50.0652 1.9021 39.9640 32.4875 103.1169 119.0492 18.6034 5.0732 2.9834 176.7026 7.2488 4.4495 3.9063 57.9690 28.1790 83.5442 2.6591 77.8112 11.0116 57.1847 13.2808 17.1452 14.5874 1.2866 236.9785 359.5610 141.0596 197.6914 225.6244 69.5532 2033.6274 29.8285 41.8110 51.3561 39.7671 24.6362 20.3331 11.5660 44.7900 59.0471 26.7084 5.5537 74.9594 8.8788 0.9126 7.0982 14.9125 4.1900 37.8158
temp: 298.150 k
press: 1.00000 atm
elementType: 8 8 7 6 6 6 6 6 6 6 6 6 6 6 6 6 6 6 6 6 6 6 1 1 1 1 1 1 1 1 1 1 1 1 1 1 1 1 1 1 1
symmnumber: 1
zpe: 878323.4 jmol-1
zpe.correction: 0.334536 hartree
zpe.thermalcorrener: 0.352138 hartree
zpe.thermalcorrenthalpy: 0.353082 hartree
zpe.thermalcorrgfe: 0.289049 hartree
zpe.sumelectzpe: -939.076775 hartree
zpe.sumelectthermal: -939.059173 hartree
zpe.sumelectthermalent: -939.058228 hartree
zpe.sumelectthermalfe: -939.122261 hartree
dipole: -5.6825 -1.4344 0.3860
dipole: 5.8735
quadrupole: -99.9291 -135.9849 -130.7372
quadrupole: -19.5888 -0.3168 -3.6413
quadrupole: 22.2880 -13.7678 -8.5201 -19.5888 -0.3168 -3.6413
hfenergy: -939.4113108 hartree
pointgroup: C01 [X(C19H19N1O2)]
dipole: -2.2277795 -0.5735035 0.2187826 debye
polarizability: 373.6835972|-1.9727379|217.124082|19.1053472|4.1527436|123.0921121 unknown
InChI: InChI=1S/C19H19NO2/c21-18-11-16-14-6-2-3-7-15(14)19(22)17(16)10-13(18)12-20-8-4-1-5-9-20/h2-3,6-7,10-11,21H,1,4-5,8-9,12H2
charge 0 multiplicity 1
41 atoms
O  -1.887893 -1.620929 -0.754026
O  2.857202 2.908376 0.195099
N  -3.49219 0.267209 -0.211234
C  -3.535427 0.338993 1.287664
C  -4.842574 0.497667 -0.812667
C  -4.515586 -0.704218 1.855572
C  -5.863621 -0.529465 -0.284882
C  -5.928874 -0.510476 1.260053
C  -2.442468 1.185134 -0.787394
C  -1.039858 0.654193 -0.525432
C  1.345718 0.975788 -0.167507
C  1.563952 -0.436954 -0.248066
C  0.054816 1.515546 -0.303778
C  -0.818793 -0.76918 -0.583937
C  3.019815 -0.693114 -0.068784
C  0.493079 -1.31384 -0.45238
C  3.675006 0.561372 0.119027
C  2.645733 1.666003 0.066719
C  3.763206 -1.885853 -0.05867
C  5.060599 0.644822 0.315564
C  5.168589 -1.807079 0.140756
C  5.812767 -0.559724 0.325667
H  -3.843408 1.36336 1.599956
H  -2.512205 0.164865 1.664205
H  -4.743881 0.415603 -1.910768
H  -5.187295 1.531779 -0.578174
H  -4.537995 -0.615243 2.957733
H  -4.142031 -1.718965 1.616091
H  -5.570694 -1.539537 -0.632263
H  -6.855392 -0.307224 -0.721732
H  -6.614367 -1.297965 1.623954
H  -6.342427 0.461194 1.600783
H  -2.555035 2.218546 -0.395249
H  -2.630611 1.221611 -1.879682
H  -0.08801 2.601627 -0.247352
H  0.612709 -2.399927 -0.508755
H  3.281026 -2.859384 -0.200734
H  5.53935 1.619463 0.457278
H  5.763773 -2.727287 0.151536
H  -2.773723 -1.004107 -0.584062
H  6.897221 -0.527581 0.477373
