program: Gaussian 09
title: 000039253
version: EM64L-G09RevD.01
frameworkgroup: C1[X(C12H2Cl8)]
method: RPBEPBE
basis: SDD
operation: Freq
keyword: #pfreq=noraman
keyword: PBEPBE/SDD
title: #p freq=noraman PBEPBE/SDD
converged: NO NO NO NO
title: Mulliken charges:
elementType: Cl Cl Cl Cl Cl Cl Cl Cl C C C C C C C C C C C C H H
charge: 0.037797 0.039203 0.003507 0.051024 0.015590 0.056834 0.061482 0.027782 0.454666 0.526218 -0.306251 -0.354805 -0.247827 -0.308553 -0.022272 -0.083064 -0.086970 -0.230826 -0.104517 -0.102952 0.282638 0.291296
chargesum: 0.00000
title: Mulliken charges with hydrogens summed into heavy atoms:
elementType: Cl Cl Cl Cl Cl Cl Cl Cl C C C C C C C C C C C C
charge: 0.037797 0.039203 0.003507 0.051024 0.015590 0.056834 0.061482 0.027782 0.454666 0.526218 -0.306251 -0.072167 -0.247827 -0.308553 -0.022272 -0.083064 -0.086970 0.060470 -0.104517 -0.102952
polarizability: 3.00261838e+02 8.43249282e+00 1.69043821e+02 -1.59366759e+00 -2.19113897e-01 1.65754642e+02
1716.lowfreq: -0.0025 -0.0024 -0.0022 3.2509 4.2315 5.4096 13.2790 31.3329 33.0980
frequency: 13.2543 31.3277 33.0968 69.6775 71.9615 77.6071 90.1813 131.9708 153.9651 177.5375 188.3610 194.7689 202.5855 206.5017 209.3845 232.3143 258.1675 274.4633 312.1157 317.5971 336.7667 350.9992 353.7007 355.5398 454.6755 505.8652 509.0244 521.3884 535.0075 542.3589 566.8725 629.0735 633.5197 659.0131 742.2125 743.0761 756.8926 773.7400 793.3302 861.9349 869.4805 883.9988 1010.2001 1061.9314 1135.5774 1160.9008 1168.2261 1253.2823 1309.5125 1328.0204 1339.3224 1345.1824 1384.1027 1437.4315 1531.7304 1532.9780 1565.9917 1583.7125 3174.0896 3185.0103
redmass: 24.0886 27.0495 24.7808 31.7983 30.2841 30.8831 25.4199 27.8241 9.8529 14.7650 20.0410 29.3548 28.3952 31.2838 34.4478 23.2937 6.3398 7.3861 28.1287 29.0499 28.8433 26.3009 12.6070 12.8300 11.5582 6.9947 7.5562 10.0282 5.0590 6.4510 11.9505 11.7815 9.0708 12.1846 7.4207 6.5657 10.0904 10.7316 11.7557 1.4239 7.5998 1.5641 10.8490 8.5442 4.1023 2.1919 1.8550 4.2411 10.7053 5.6568 10.9394 9.4267 3.2345 5.9689 10.3468 10.3534 9.0801 9.0758 1.0933 1.0935
irintensity: 0.0341 0.0030 0.0171 0.0160 0.0067 0.0184 0.0185 0.0544 0.1365 0.1535 0.1629 0.0956 0.2715 0.0163 0.0063 0.0509 1.5685 1.3055 0.1943 0.0721 0.0589 0.1097 0.2623 0.6638 24.2192 3.4269 0.8413 11.5708 9.7021 7.7189 38.5784 14.2273 4.3934 14.5760 10.3650 8.5133 49.9779 38.2212 34.0512 18.7675 8.1229 4.7952 18.3033 22.4507 3.8538 38.6241 38.2540 10.7366 93.9952 69.8437 5.0963 26.7385 205.5022 14.5939 20.1467 30.9817 30.0968 16.3497 0.3547 3.0762
temp: 298.150 k
press: 1.00000 atm
elementType: 17 17 17 17 17 17 17 17 6 6 6 6 6 6 6 6 6 6 6 6 1 1
symmnumber: 1
zpe: 263971.0 jmol-1
zpe.correction: 0.100541 hartree
zpe.thermalcorrener: 0.120289 hartree
zpe.thermalcorrenthalpy: 0.121233 hartree
zpe.thermalcorrgfe: 0.048335 hartree
zpe.sumelectzpe: -4137.536001 hartree
zpe.sumelectthermal: -4137.516253 hartree
zpe.sumelectthermalent: -4137.515309 hartree
zpe.sumelectthermalfe: -4137.588207 hartree
dipole: 1.2421 -0.6431 1.2655
dipole: 1.8862
quadrupole: -174.0001 -169.1333 -167.5924
quadrupole: 0.2118 4.5857 -0.1178
quadrupole: -3.7582 1.1086 2.6495 0.2118 4.5857 -0.1178
hfenergy: -4137.6365419 hartree
pointgroup: C01 [X(C12H2Cl8)]
dipole: -0.5009724 0.2378633 0.4931144 debye
dipolederiv: -0.2452168 -0.2499947 -0.0534102 -0.2793445 -0.4717397 -0.1113229 -0.0604265 -0.1147568 -0.0266899 -0.2132311 -0.0607537 0.224105 -0.0682194 -0.0384143 0.1353892 0.2229966 0.1355694 -0.4884304 -0.3180792 0.07472 -0.2597699 0.0686897 -0.062227 0.1414311 -0.2669531 0.1400935 -0.5301615 -0.2340257 0.2688998 0.0892788 0.3129556 -0.4222152 -0.1402049 0.1069483 -0.1420612 -0.0369317 -0.2195968 -0.2433744 -0.0578423 -0.3178179 -0.5820126 -0.1431825 -0.0748814 -0.1430181 -0.0510931 -0.2869698 0.0834931 -0.2834772 0.1025083 -0.017605 0.1134939 -0.3663247 0.1165892 -0.3882771 -0.7344923 -0.0639573 0.0288033 -0.0412236 -0.0042196 -0.0025879 0.0433795 -0.0006739 0.0121007 -0.808967 -0.0179198 0.0875344 -0.0290829 -0.0149607 0.0154391 0.1075831 0.0148374 -0.0668942 0.2618507 -0.0818224 -0.0282989 -0.1001921 -0.0391895 -0.0061137 -0.0436361 -0.0101788 0.0165914 0.2295605 -0.0254645 -0.0739569 -0.0538708 -0.0421981 0.0987513 -0.0275175 0.0988683 -0.3603036 0.1314641 0.4691551 0.1152405 0.4647193 0.5674029 0.1273336 0.1166501 0.1355618 0.0030509 -0.2145132 -0.1115072 -0.0278883 0.0108092 -0.1748703 -0.0348217 0.0121355 -0.0294901 -0.0591225 0.2244225 0.1064427 -0.3684404 0.1060638 0.0389541 -0.170877 -0.3586899 -0.1829552 0.6541479 0.4228453 -0.1105653 0.4066043 -0.0745293 0.0199644 -0.2564039 0.2777733 -0.2404163 0.8178581 0.07147 -0.5082618 -0.1457103 -0.5721545 0.5209269 0.1849027 -0.1669693 0.1853209 0.0588669 0.0851501 0.4356676 0.1179909 0.4336706 0.8682354 0.2312082 0.1152225 0.2231701 0.0277114 0.0066172 -0.1679424 0.6036466 -0.181743 -0.0042477 -0.1293147 0.6706418 -0.1300674 0.4082953 -0.4767897 0.0322718 -0.1001479 0.0319596 -0.0620202 0.0492327 -0.0844852 0.0443825 -0.2226037 0.9984512 0.0705884 -0.0497748 0.0803295 -0.2597374 -0.0684283 -0.0538555 -0.067383 -0.0564929 1.1806043 0.0681941 -0.2521624 0.0538227 -0.0245541 -0.0382031 -0.2013913 -0.0354559 0.1023531 0.0743841 0.033824 0.016198 0.0581132 0.0478841 -0.0261946 0.0197392 -0.0267655 0.1267984 0.0650615 -0.0016933 0.0114775 -0.0054634 0.1568435 0.0304732 0.0120607 0.0288292 0.0592261 unknown
polarizability: 300.1326641|7.8381667|168.9603792|5.4397646|0.5306792|165.9672575 unknown
InChI: InChI=1S/C12H2Cl8/c13-4-2-6(15)9(17)11(19)7(4)3-1-5(14)10(18)12(20)8(3)16/h1-2H
charge 0 multiplicity 1
22 atoms
Cl 0.499004 -2.586816 -0.637112
Cl -0.929992 0.779189 -2.459865
Cl -0.546971 -0.706121 2.888986
Cl 3.716216 -2.435589 -0.835581
Cl 3.493442 2.931041 0.700215
Cl -4.149321 0.720604 -2.231086
Cl 5.235809 0.326086 -0.166337
Cl -5.519662 -0.071356 0.609929
C  0.605778 0.089882 0.11182
C  -0.887552 0.041615 0.216989
C  1.361643 -1.046006 -0.265412
C  1.28461 1.29403 0.401398
C  -1.716782 0.350311 -0.892719
C  -1.536984 -0.294874 1.429855
C  2.772123 -0.982291 -0.353251
C  2.685938 1.363331 0.316288
C  -3.129721 0.324411 -0.804291
C  -2.936713 -0.33101 1.553584
C  3.443811 0.231129 -0.060388
C  -3.726088 -0.019745 0.431085
H  0.716908 2.181289 0.693527
H  -3.408495 -0.59661 2.502367
