program: Gaussian 09
title: 000039236
version: EM64L-G09RevD.01
frameworkgroup: C1[X(C10H5Cl2NO2)]
method: RPBEPBE
basis: SDD
operation: Freq
keyword: #p
keyword: freq=noraman
keyword: PBEPBE/SDD
title: #p freq=noraman PBEPBE/SDD
converged: NO NO NO NO
title: Mulliken charges:
elementType: Cl Cl O O N C C C C C C C C C C H H H H H
charge: 0.062962 -0.052942 -0.155983 -0.168151 -0.353296 0.526767 0.247959 0.169173 -0.317872 -0.361791 -0.210740 -0.224025 -0.086677 -0.199350 -0.246952 0.296677 0.275532 0.298191 0.238502 0.262016
chargesum: 0.00000
title: Mulliken charges with hydrogens summed into heavy atoms:
elementType: Cl Cl O O N C C C C C C C C C C
charge: 0.062962 -0.052942 -0.155983 -0.168151 -0.353296 0.526767 0.247959 0.169173 -0.021195 -0.086258 -0.210740 0.074165 -0.086677 0.039152 0.015064
polarizability: 2.07515235e+02 -1.32024971e+01 1.47269079e+02 3.34212039e+00 1.16162385e-01 6.17467405e+01
1716.lowfreq: -3.6401 -0.0005 0.0028 0.0028 3.5667 10.3531 28.2153 57.8095 87.4487
frequency: 28.1691 57.8080 87.4483 139.4254 155.5046 176.4936 187.8341 244.2737 274.8872 290.4916 347.4717 363.4519 383.0963 416.5910 437.2406 491.7248 555.6734 594.3096 641.6274 656.0154 679.1328 688.0142 721.0085 735.8670 784.7480 814.8016 846.9411 874.0319 900.4378 976.0784 981.4114 985.5899 1024.0031 1079.5268 1084.2704 1105.3446 1172.4132 1186.4725 1225.8116 1294.9342 1340.1519 1378.1216 1429.0091 1472.9808 1578.1417 1603.7902 1606.6005 1629.9611 1679.6962 3151.4847 3179.7926 3197.1159 3202.9199 3236.0351
redmass: 11.9560 9.5435 9.2120 10.7475 8.4357 8.0412 6.9917 11.8735 5.9400 8.4477 13.6084 6.3457 8.1888 7.3724 3.1184 10.2172 5.7464 7.0604 5.7974 7.7461 2.3345 4.3910 7.6893 10.2520 1.4411 8.3756 1.5132 1.5038 1.3950 1.4313 5.1021 5.3338 5.8142 2.0890 2.8330 1.7409 4.4497 1.0931 2.0867 1.3603 4.6155 9.5228 2.8795 2.5511 6.8239 8.6342 6.7098 12.0542 12.5061 1.0886 1.0953 1.0957 1.0936 1.1007
irintensity: 0.3040 2.0547 0.6056 1.7283 5.5424 0.1271 0.4848 0.9314 1.5035 6.0731 0.4621 0.6581 6.4745 3.1453 6.6484 17.0093 0.0377 16.7262 0.3992 7.9055 23.6664 3.8929 88.8914 6.5567 54.2837 12.0030 38.6715 22.8119 2.2016 0.3407 15.2948 1.1897 86.0199 19.0459 23.3744 21.3787 142.6394 0.5743 10.8979 20.2542 295.4317 1.3813 37.9825 154.4673 31.6920 154.6655 37.4232 433.8468 1.1774 7.8206 3.2079 0.3205 2.4495 3.3385
temp: 298.150 k
press: 1.00000 atm
elementType: 17 17 8 8 7 6 6 6 6 6 6 6 6 6 6 1 1 1 1 1
symmnumber: 1
zpe: 331223.1 jmol-1
zpe.correction: 0.126156 hartree
zpe.thermalcorrener: 0.138873 hartree
zpe.thermalcorrenthalpy: 0.139818 hartree
zpe.thermalcorrgfe: 0.085240 hartree
zpe.sumelectzpe: -1508.337830 hartree
zpe.sumelectthermal: -1508.325112 hartree
zpe.sumelectthermalent: -1508.324168 hartree
zpe.sumelectthermalfe: -1508.378746 hartree
dipole: -1.6155 0.5250 0.6832
dipole: 1.8309
quadrupole: -96.4892 -100.0819 -100.8981
quadrupole: 14.4287 -0.7144 6.0051
quadrupole: 2.6672 -0.9255 -1.7417 14.4287 -0.7144 6.0051
hfenergy: -1508.4639857 hartree
pointgroup: C01 [X(C10H5Cl2N1O2)]
dipole: -0.6064873 0.2652379 0.2840864 debye
dipolederiv: -0.7538216 0.2613 -0.119466 0.2808232 -0.1265586 0.0594856 -0.1187082 0.0601005 0.0080313 -0.5174355 0.2867531 0.130214 0.3665774 -0.3940771 -0.1444519 0.1652584 -0.1342581 -0.126951 -0.4569325 -0.0722638 0.0212911 0.3001592 -0.8525749 0.1821935 -0.1048553 0.1228121 -0.3246617 -0.6020737 0.3371711 -0.1274394 -0.0497473 -0.8961486 0.173264 0.0088492 0.1732041 -0.3413865 -1.5910261 -0.0581731 -0.0627296 -0.3040519 -0.997857 0.1661471 -0.0381585 0.1737958 -0.1851185 1.1589251 0.1876455 -0.0113314 0.2393102 0.1542947 0.1154866 -0.0126425 0.0774828 0.1080403 1.0552616 -0.0209257 0.0632653 -0.5081077 1.1202817 -0.2736488 0.1007874 -0.2136382 0.352136 1.3091427 -0.2184432 0.1388891 0.659467 1.3760035 -0.2943724 0.0202855 -0.263494 0.32969 -0.4527274 0.1291376 0.0483185 0.1742402 -0.1327029 -0.0341183 0.0327698 -0.0672058 -0.1152506 -0.2087376 -0.0772424 -0.0179164 -0.1651791 -0.1268726 0.0221314 0.0199993 -0.0108829 -0.1381489 0.8910359 -0.6171916 0.2275793 -0.8241292 0.2123159 -0.1267324 0.294292 -0.1190302 -0.0324765 -0.832714 0.2790796 -0.1210283 0.2938033 -0.1127769 0.0274279 -0.1485706 0.0141417 -0.1232731 0.7826101 -0.4919098 -0.2126285 -0.5858928 0.5835839 0.2725218 -0.2833323 0.2400802 0.0497833 0.1129539 0.015171 -0.0236749 0.0515323 0.1209139 0.0832745 0.0256507 0.0768176 -0.1054711 -0.1802043 0.1184532 0.0458108 0.1504455 -0.2209765 -0.0630796 0.0616465 -0.0432582 -0.1407181 0.1504111 -0.0425569 -0.0021056 -0.027023 0.0591025 -0.0441528 -0.026743 -0.0122074 0.1513217 0.0601554 0.0709272 0.0332201 0.063392 0.08516 -0.043867 0.0316041 -0.0082375 0.1477646 0.0607467 -0.0204186 -0.0051945 -0.0427598 0.0975292 0.0190196 -0.0143695 0.0178916 0.1897751 0.049977 -0.0317994 -0.0070603 -0.0496456 -0.0562513 -0.0745493 -0.0133867 -0.0704722 0.1322975 -0.0355469 -0.0347138 0.0019869 -0.023214 0.1076111 -0.0219797 -0.0003763 -0.0136421 0.1646161 unknown
polarizability: 203.8760327|-19.6341797|150.8205301|1.4782512|3.4093182|61.8344917 unknown
InChI: InChI=1S/C10H5Cl2NO2/c11-6-2-1-3-7(4-6)13-9(14)5-8(12)10(13)15/h1-5H
charge 0 multiplicity 1
20 atoms
Cl -4.635992 0.690505 -0.431875
Cl 4.244876 -1.566842 -0.784078
O  -1.705534 2.007051 -0.489538
O  -0.598728 -2.452031 0.61483
N  -0.721314 -0.114225 0.0706
C  0.673593 0.239044 0.101071
C  -1.791614 0.79046 -0.223108
C  -1.2605 -1.428907 0.328274
C  1.642116 -0.713803 -0.305102
C  1.069009 1.530372 0.531186
C  -3.052878 -0.047145 -0.13331
C  -2.74796 -1.330732 0.180617
C  2.996285 -0.342337 -0.264459
C  2.438703 1.865249 0.545567
C  3.424235 0.932521 0.150816
H  1.349942 -1.714525 -0.626036
H  0.320212 2.264881 0.833024
H  -3.398635 -2.191405 0.324243
H  2.745048 2.863673 0.873742
H  4.487034 1.187596 0.166333
