program: Gaussian 09
title: 000039298
version: EM64L-G09RevD.01
frameworkgroup: C1[X(C21H24N2O2)]
method: RPBEPBE
basis: SDD
operation: Freq
keyword: #p
keyword: freq=noraman
keyword: PBEPBE/SDD
title: #p freq=noraman PBEPBE/SDD
converged: YES YES NO NO
title: Mulliken charges:
elementType: O O N N C C C C C C C C C C C C C C C C C C C C C H H H H H H H H H H H H H H H H H H H H H H H H
charge: -0.247004 -0.229050 -0.193764 -0.108961 -0.452072 -0.394752 -0.447020 -0.338989 0.231246 0.247847 0.097509 -0.361161 -0.333243 0.496170 -0.327694 -0.317818 -0.395982 -0.350676 -0.258011 -0.222171 -0.399460 -0.382176 -0.234018 -0.237836 -0.241969 0.270243 0.207947 0.281933 0.247745 0.220715 0.197578 0.201278 0.256247 0.191542 0.190342 0.204208 0.216641 0.197771 0.189754 0.211928 0.254117 0.241021 0.229386 0.225853 0.238712 0.247180 0.225833 0.224900 0.228182
chargesum: 0.00000
title: Mulliken charges with hydrogens summed into heavy atoms:
elementType: O O N N C C C C C C C C C C C C C C C C C C C C C
charge: -0.247004 -0.229050 -0.193764 -0.108961 -0.181829 0.095128 0.021440 0.059867 0.231246 0.247847 0.097509 0.086628 0.061307 0.496170 0.086717 0.083864 -0.141865 -0.109655 -0.028625 0.003682 -0.160748 -0.134996 -0.008185 -0.012936 -0.013788
polarizability: 2.64567477e+02 3.04792879e+00 2.79011131e+02 -1.23215177e+01 1.59369534e+01 1.75424807e+02
1716.lowfreq: -6.5450 -1.0922 0.0004 0.0004 0.0006 6.4976 15.1577 20.5594 25.1623
frequency: 14.7540 20.1956 24.8285 29.5403 51.9678 62.1057 67.0569 86.2556 116.7888 135.1074 177.3978 217.5332 229.7260 239.9137 247.6941 257.7815 270.0752 293.0737 307.3379 338.9222 364.7565 394.0402 403.9512 408.4322 435.9959 468.3299 472.0863 484.8962 496.2661 500.0549 561.0662 586.8171 596.7544 615.8442 634.2017 652.5220 687.9969 703.7622 721.4879 724.6451 747.8865 759.6951 770.8338 805.7383 814.7257 832.7130 844.2769 853.9667 865.0483 869.7972 880.0753 903.9246 914.9542 931.4790 941.6958 961.2638 977.6142 979.7825 991.1146 995.9583 1021.0009 1027.5555 1027.8073 1030.9844 1054.9270 1055.9639 1069.4105 1074.7420 1081.7351 1087.9064 1103.3373 1111.3887 1139.8576 1145.8886 1167.2598 1171.8550 1173.1654 1179.2684 1191.7688 1192.7890 1197.4940 1204.9803 1231.1193 1247.3077 1263.4501 1268.2290 1274.4966 1288.4548 1297.4595 1314.1684 1323.6196 1329.6585 1331.4197 1341.5440 1342.5280 1362.6520 1369.9174 1372.6552 1382.4869 1386.9231 1406.9477 1441.0450 1445.7901 1451.6124 1453.0612 1454.9249 1460.2443 1467.8637 1473.6465 1480.2626 1482.2159 1486.5926 1592.9066 1600.0274 1611.8842 1621.5533 1644.5708 2841.5801 2859.3898 2871.0435 2951.7521 2961.5711 2984.0045 2994.8238 3000.4898 3015.3604 3017.5106 3043.7879 3054.7058 3078.0388 3084.5832 3088.2587 3122.2517 3127.5110 3129.8832 3138.7324 3139.4360 3148.4899 3152.2179 3164.1595 3167.2553
redmass: 4.6166 5.6723 3.9988 4.3497 4.0631 4.3720 4.4906 4.2749 7.2627 4.1262 4.2155 2.4143 3.8166 3.3732 2.0609 4.2210 3.1670 2.8898 2.3166 4.9285 4.6873 2.0888 2.8208 3.6121 3.8822 2.9293 5.2711 4.3573 4.4653 4.3394 3.6595 2.0562 4.9632 6.0231 4.6894 5.5497 5.3768 1.9621 2.1267 2.1484 2.3995 1.5508 1.8599 3.6759 2.6743 2.7195 1.5819 1.2657 1.6488 2.0736 3.1373 2.5837 2.5934 1.7307 1.4115 2.4490 1.3447 1.3699 5.7309 1.3198 2.1565 2.2437 2.2251 2.3167 4.2312 2.4769 2.2175 2.6344 2.0386 2.1860 2.3855 2.3608 2.7624 1.8866 1.2322 1.3528 1.1210 1.6535 1.1266 1.3643 1.3220 1.4188 1.2737 1.5350 1.6446 1.9114 1.5045 1.2581 1.2970 1.3753 1.9478 1.3438 1.3056 1.4616 1.8469 1.4379 1.3921 1.3121 8.2099 1.4200 4.2640 2.2189 1.0810 1.0907 1.1328 2.1893 1.1278 1.0963 1.1014 2.4760 1.2077 2.5487 6.2628 7.2260 6.2761 7.6051 10.0601 1.0708 1.0702 1.0686 1.0665 1.0670 1.0816 1.0853 1.0642 1.0626 1.0885 1.0916 1.0972 1.0966 1.1039 1.0972 1.0845 1.0877 1.0853 1.0908 1.0915 1.0966 1.0945 1.1016 1.1003
irintensity: 0.1614 0.0161 0.3844 0.7960 1.5054 0.1882 0.8631 0.7866 1.6450 1.6042 1.2702 0.6875 1.4841 1.8002 2.5146 2.0353 6.0717 4.5900 13.4982 5.3161 1.5288 0.5096 0.2401 4.7390 3.2434 1.3470 5.1702 1.6842 12.4321 6.3821 16.1738 10.0965 15.3360 1.7236 3.4438 7.5311 1.6707 37.7058 41.8561 2.7802 16.4337 78.8875 8.4456 28.4121 0.1951 3.4432 0.1833 0.1835 1.1212 1.3308 4.3247 7.2675 20.5928 8.4694 2.7381 19.3321 0.1075 0.1373 1.0419 0.0639 7.6772 9.6388 7.7390 13.1390 4.6177 31.7219 2.2415 13.1658 23.8372 33.4566 25.7756 2.5778 54.3840 18.4150 0.5332 21.7993 8.0113 2.4366 1.1038 16.0012 3.2581 9.8210 25.3917 19.3221 29.2511 5.8201 5.9228 1.8768 1.6774 2.9652 93.9505 35.8656 1.8161 31.1565 10.6479 4.6227 0.6966 3.5468 0.0752 3.2019 6.6490 8.9585 2.8531 12.1396 13.3847 34.6092 9.5091 1.3007 10.5244 57.6588 47.3191 74.1395 7.5563 62.5223 26.4055 151.7529 156.9423 54.6994 61.3316 174.9713 56.8689 72.5021 4.7093 20.5894 20.4203 14.4342 62.4290 9.0769 21.6243 47.4021 12.1569 31.6408 2.8252 0.3637 1.4621 19.1893 10.0008 35.0021 26.2189 24.9721 20.7666
temp: 298.150 k
press: 1.00000 atm
elementType: 8 8 7 7 6 6 6 6 6 6 6 6 6 6 6 6 6 6 6 6 6 6 6 6 6 1 1 1 1 1 1 1 1 1 1 1 1 1 1 1 1 1 1 1 1 1 1 1 1
symmnumber: 1
zpe: 1068837.4 jmol-1
zpe.correction: 0.407099 hartree
zpe.thermalcorrener: 0.428977 hartree
zpe.thermalcorrenthalpy: 0.429921 hartree
zpe.thermalcorrgfe: 0.352716 hartree
zpe.sumelectzpe: -1072.754439 hartree
zpe.sumelectthermal: -1072.732561 hartree
zpe.sumelectthermalent: -1072.731616 hartree
zpe.sumelectthermalfe: -1072.808822 hartree
dipole: -1.9194 3.5596 1.6215
dipole: 4.3571
quadrupole: -151.2664 -139.2904 -144.9232
quadrupole: 14.5840 3.5177 1.2075
quadrupole: -6.1064 5.8696 0.2368 14.5840 3.5177 1.2075
hfenergy: -1073.1615378 hartree
pointgroup: C01 [X(C21H24N2O2)]
dipole: -0.6706606 1.3768164 0.7701146 debye
polarizability: 263.2662149|5.5269608|276.1362451|-16.177116|22.8680435|179.6009548 unknown
InChI: InChI=1S/C21H24N2O2/c24-21-20(17-7-2-1-3-8-17)18-9-4-5-10-19(18)23(21)12-6-11-22-13-15-25-16-14-22/h1-5,7-10,20H,6,11-16H2
charge 0 multiplicity 1
49 atoms
O  5.943469 -1.703767 -0.937837
O  0.215662 -1.114751 -1.106919
N  -0.048164 1.106301 -0.346268
N  4.08201 0.176038 0.278158
C  -2.073202 -0.039037 -0.910519
C  1.382118 1.360593 -0.117872
C  1.857575 0.855641 1.26467
C  3.396245 0.882017 1.388647
C  -2.354273 1.364916 -0.398165
C  -1.120975 1.998631 -0.080932
C  -0.516601 -0.131799 -0.814545
C  3.780913 -1.281632 0.227077
C  5.54998 0.402657 0.310559
C  -2.766383 -1.199293 -0.195003
C  4.486502 -1.923313 -0.977858
C  6.215837 -0.258961 -0.906396
C  -3.561456 2.056703 -0.224916
C  -1.067748 3.316453 0.410341
C  -3.529634 3.38931 0.265902
C  -2.295288 4.006068 0.577979
C  -2.951567 -2.42679 -0.87889
C  -3.182909 -1.097156 1.156146
C  -3.546976 -3.530092 -0.229009
C  -3.778928 -2.200282 1.807294
C  -3.964532 -3.420456 1.117558
H  -2.314466 -0.107469 -1.990929
H  1.578711 2.441575 -0.237063
H  1.95413 0.829669 -0.897609
H  1.478379 -0.171899 1.411714
H  1.426136 1.473348 2.075761
H  3.681141 0.457867 2.386517
H  3.748459 1.933229 1.375387
H  2.693008 -1.433371 0.10765
H  4.110742 -1.792302 1.167095
H  6.009042 -0.011621 1.244539
H  5.745572 1.492484 0.290723
H  4.352058 -3.017161 -0.975313
H  4.070115 -1.500957 -1.91753
H  5.837762 0.2148 -1.8386
H  7.313594 -0.163757 -0.860072
H  -4.516079 1.572362 -0.45813
H  -0.118392 3.801446 0.65871
H  -4.464714 3.941681 0.405598
H  -2.284024 5.033813 0.958037
H  -2.616152 -2.521368 -1.918244
H  -3.048763 -0.15308 1.696273
H  -3.683905 -4.472388 -0.77124
H  -4.098303 -2.107327 2.851619
H  -4.428926 -4.274873 1.622604
