program: Gaussian 09
title: 000039264
version: EM64L-G09RevD.01
frameworkgroup: C1[X(C19H22N2O2)]
method: RPBEPBE
basis: SDD
operation: Freq
keyword: #p
keyword: freq=noraman
keyword: PBEPBE/SDD
title: #p freq=noraman PBEPBE/SDD
converged: YES YES NO NO
title: Mulliken charges:
elementType: O O N N C C C C C C C C C C C C C C C C C C C H H H H H H H H H H H H H H H H H H H H H H
charge: -0.265587 -0.204014 -0.193382 -0.291734 0.001444 0.215412 0.265394 0.037584 0.380938 -0.410821 -0.389523 -0.356714 -0.373138 -0.383452 -0.355269 -0.259936 -0.221381 -0.221098 -0.246053 -0.234605 -0.686304 -0.238432 -0.625225 0.274131 0.208071 0.266513 0.240731 0.203451 0.237431 0.246285 0.268068 0.231700 0.211446 0.202086 0.226253 0.223590 0.224059 0.252595 0.203829 0.227020 0.231729 0.225958 0.233429 0.192742 0.224776
chargesum: 0.00000
title: Mulliken charges with hydrogens summed into heavy atoms:
elementType: O O N N C C C C C C C C C C C C C C C C C C C
charge: -0.265587 -0.204014 -0.193382 -0.039139 0.001444 0.215412 0.265394 0.037584 0.380938 0.071381 -0.123010 -0.115982 0.067743 -0.137168 -0.087201 -0.028235 0.192151 0.005155 -0.022462 -0.010545 -0.023726 -0.012473 0.025723
polarizability: 2.54050240e+02 1.71894973e+01 2.37230878e+02 5.94210194e+00 -5.64230419e+00 1.77971247e+02
1716.lowfreq: -2.9948 0.0002 0.0006 0.0008 5.2764 6.9832 22.0232 25.8741 29.3312
frequency: 21.6919 25.7878 29.2293 52.4578 63.7826 68.5348 77.8646 83.5249 91.3958 100.0972 127.8308 159.3889 203.2108 211.4933 218.9478 229.1889 243.0685 256.9358 283.0712 288.2146 297.2318 322.6301 338.2523 385.7540 402.6133 416.3231 455.9213 474.3629 496.2124 516.3482 579.8852 591.5022 616.0231 631.2300 655.8967 665.2676 684.6604 699.2294 709.5271 746.2867 759.4478 763.4413 781.2422 820.7770 846.8572 852.5366 855.5649 866.8602 913.0188 934.5613 941.6530 951.6684 964.7987 978.9027 981.0708 985.5243 990.2865 996.4396 1016.8461 1021.2688 1029.7772 1040.9521 1058.2754 1063.2124 1083.1146 1096.0130 1115.3298 1118.3889 1138.0098 1143.9145 1166.2183 1169.4533 1172.2183 1179.6017 1189.5836 1209.5454 1244.6041 1254.7553 1256.0084 1285.9037 1312.4996 1318.1620 1326.5957 1336.8942 1369.2173 1376.0250 1382.2065 1393.4593 1407.1284 1434.9590 1436.3076 1453.0932 1454.3183 1458.6053 1460.7197 1469.0979 1477.4138 1479.7311 1482.2835 1488.0553 1491.3259 1497.0550 1591.5396 1602.4021 1610.4654 1621.1690 1654.9510 2858.9228 2881.4173 2950.0847 2993.5554 2993.7719 3005.0048 3019.2108 3028.4718 3079.1944 3088.2740 3090.4105 3102.0467 3122.7493 3130.9636 3134.2100 3142.3621 3147.2075 3153.5916 3160.3676 3168.2236 3181.5087 3449.9358
redmass: 3.4966 4.6225 3.7065 3.3195 3.3335 3.7911 1.9174 2.7978 2.7344 2.5871 6.4856 3.4718 2.1283 2.1375 3.2509 2.5162 1.7869 2.7875 3.9307 3.5072 4.0660 4.6987 4.2961 4.7185 2.8314 3.2817 3.7283 7.6550 3.7820 4.4598 5.3986 4.6677 6.4140 4.3576 1.4737 4.9520 6.2334 2.0656 3.6711 3.0962 1.4940 2.1098 1.4278 1.0988 2.5899 1.4366 1.6153 2.1054 2.2124 2.6543 1.8517 2.3071 2.3382 1.3838 1.3889 3.7031 5.9799 1.3385 2.8050 2.3442 2.1750 3.6108 4.1603 1.9542 1.6726 1.8205 2.1940 1.5643 1.4419 1.7541 1.5046 2.7349 1.0530 1.6761 1.1577 2.1601 2.6628 1.7689 1.1649 1.2627 1.4845 1.3349 1.8200 2.6106 1.2821 1.3499 9.0298 1.2692 4.7160 2.2382 1.1470 1.3939 1.6922 1.0408 1.2022 1.0898 2.7275 1.0581 2.6645 1.0666 1.0799 1.0625 6.2851 7.4852 6.2002 7.6749 10.7575 1.0707 1.0559 1.0549 1.0402 1.0617 1.1072 1.0758 1.0862 1.0999 1.0988 1.0988 1.1012 1.0846 1.0854 1.0888 1.0898 1.0937 1.0948 1.0991 1.1002 1.0957 1.0745
irintensity: 0.4853 0.2485 0.1554 0.5537 0.3338 0.5605 1.5915 2.6317 1.7345 3.1665 2.7769 0.5254 0.5923 1.4070 1.0350 0.6799 0.6001 2.9601 0.5964 4.5845 4.7191 2.2166 3.7361 3.9398 0.0378 18.5247 2.5689 6.2812 5.0898 1.8406 24.2737 7.1158 0.0457 41.9022 67.8797 7.2445 2.2785 35.5960 22.4792 10.9572 69.3685 55.7029 4.3411 2.3519 3.6460 1.8779 2.9539 3.4591 3.9905 17.1608 4.3593 7.4028 1.8740 1.7449 2.5015 42.6315 3.0465 0.8089 12.1974 8.5913 18.8760 99.7692 40.5960 33.7821 13.2178 10.9175 8.0039 5.1475 3.1362 25.4284 11.0371 46.0678 0.0896 20.6737 5.0888 35.9917 5.8851 13.5394 2.1265 7.7103 21.6835 1.2905 81.1118 28.9059 4.1414 1.9511 0.0321 25.7215 6.4154 12.7070 2.0659 20.6415 11.4569 12.9794 49.7336 11.4841 72.1601 6.8315 47.1182 16.1747 6.0192 6.8423 0.3955 42.9851 5.0863 124.2756 156.1352 99.6872 153.1261 44.9958 44.7424 9.7604 24.5339 48.2928 17.8372 38.1723 4.7851 30.0950 29.5537 0.1025 2.6938 9.1023 9.6641 33.2854 22.2653 30.0885 21.4137 4.7510 0.8593
temp: 298.150 k
press: 1.00000 atm
elementType: 8 8 7 7 6 6 6 6 6 6 6 6 6 6 6 6 6 6 6 6 6 6 6 1 1 1 1 1 1 1 1 1 1 1 1 1 1 1 1 1 1 1 1 1 1
symmnumber: 1
zpe: 969128.8 jmol-1
zpe.correction: 0.369122 hartree
zpe.thermalcorrener: 0.391448 hartree
zpe.thermalcorrenthalpy: 0.392392 hartree
zpe.thermalcorrgfe: 0.315417 hartree
zpe.sumelectzpe: -995.481865 hartree
zpe.sumelectthermal: -995.459538 hartree
zpe.sumelectthermalent: -995.458594 hartree
zpe.sumelectthermalfe: -995.535569 hartree
dipole: 3.1439 3.7623 0.3856
dipole: 4.9181
quadrupole: -118.8120 -135.8231 -132.0661
quadrupole: 4.6349 2.0302 -6.0363
quadrupole: 10.0884 -6.9227 -3.1657 4.6349 2.0302 -6.0363
hfenergy: -995.8509864 hartree
pointgroup: C01 [X(C19H22N2O2)]
dipole: 1.2644703 1.4460404 -0.2324299 debye
polarizability: 254.92912|16.7970684|230.9501968|-1.2953453|-18.6930658|183.3730489 unknown
InChI: InChI=1S/C19H22N2O2/c1-3-23-19(15-9-5-4-6-10-15)16-11-7-8-12-17(16)21(18(19)22)14-13-20-2/h4-12,20H,3,13-14H2,1-2H3
charge 0 multiplicity 1
45 atoms
O  -0.999525 -0.210476 2.0125
O  0.337404 -2.302612 0.174988
N  1.282199 -0.294962 -0.642763
N  4.865951 -1.41301 -1.109861
C  -0.795528 -0.052248 0.561448
C  -0.207381 1.296895 0.167134
C  1.004591 1.097143 -0.544176
C  0.310158 -1.056197 0.029682
C  -2.137973 -0.396113 -0.092884
C  2.45917 -0.890609 -1.286753
C  -0.677412 2.593774 0.411714
C  1.757627 2.177555 -1.040279
C  3.707368 -0.88364 -0.371096
C  -2.614866 0.299935 -1.230185
C  -2.888826 -1.481424 0.425118
C  0.070585 3.699531 -0.073477
C  0.228047 -0.112831 2.83335
C  1.269169 3.48647 -0.794857
C  -3.83583 -0.075284 -1.835182
C  -4.11056 -1.849739 -0.17704
C  -0.212431 -0.243152 4.290607
C  -4.589072 -1.149087 -1.309453
C  6.047143 -1.725586 -0.283842
H  2.213583 -1.934554 -1.542747
H  2.666295 -0.344395 -2.227876
H  -1.608543 2.7436 0.96852
H  2.690446 2.026298 -1.59275
H  3.868131 0.144273 0.042332
H  3.513164 -1.550056 0.489999
H  -2.040607 1.137302 -1.640441
H  -2.508417 -2.017335 1.298324
H  -0.281341 4.720202 0.108667
H  0.924976 -0.930914 2.555971
H  0.726912 0.86175 2.650751
H  1.835864 4.346703 -1.168762
H  -4.197987 0.47202 -2.712859
H  -4.687302 -2.686058 0.23379
H  5.103646 -0.831995 -1.92453
H  0.66413 -0.186038 4.961802
H  -0.913764 0.565654 4.559025
H  -0.717797 -1.210023 4.45648
H  -5.5369 -1.438551 -1.777511
H  5.790578 -2.5256 0.434592
H  6.444753 -0.861087 0.301895
H  6.858773 -2.106329 -0.928566
