program: Gaussian 09
title: 000005611
version: EM64L-G09RevD.01
frameworkgroup: C1[X(C15H18I3NO3)]
method: RPBEPBE
basis: SDD
operation: Freq
keyword: #p
keyword: freq=noraman
keyword: PBEPBE/SDD
title: #p freq=noraman PBEPBE/SDD
converged: NO YES NO NO
title: Mulliken charges:
elementType: I I I O O O N C C C C C C C C C C C C C C C H H H H H H H H H H H H H H H H H H
charge: 0.103162 0.130821 0.139432 -0.405085 -0.226243 -0.210258 -0.513067 -0.060784 -0.726727 -0.389381 0.790730 -0.715278 0.151908 -0.710918 -0.613574 0.736517 -0.092801 -0.514297 -0.500703 0.227198 -0.347413 -0.685055 0.265308 0.260853 0.271166 0.229349 0.209598 0.213884 0.218854 0.241005 0.276591 0.323757 0.208709 0.236097 0.212135 0.243395 0.379983 0.209622 0.224438 0.207074
chargesum: 0.00000
title: Mulliken charges with hydrogens summed into heavy atoms:
elementType: I I I O O O N C C C C C C C C C C C C C C C
charge: 0.103162 0.130821 0.139432 -0.025102 -0.226243 -0.210258 -0.189310 0.204525 -0.194708 0.049566 0.790730 -0.715278 0.151908 -0.037176 -0.613574 0.736517 0.183789 -0.514297 -0.055897 0.227198 0.108117 -0.043922
polarizability: 3.42457589e+02 -3.97635845e+00 2.88388152e+02 -6.50418433e+00 -1.61230934e+01 1.48576646e+02
1716.lowfreq: -3.6860 -1.7742 -0.0003 -0.0002 0.0004 5.5193 15.3251 20.3980 22.5694
frequency: 15.0845 20.3430 22.5612 26.7538 36.8666 44.5468 49.1884 54.4720 70.9943 77.5901 88.3189 95.5861 101.2093 109.0320 138.9086 160.0463 162.7589 166.7234 170.2069 203.4581 217.9463 234.9328 256.5216 273.6629 277.1877 318.0977 331.4197 355.5612 380.5623 405.5996 415.5438 451.7144 493.4101 511.2626 531.4286 570.1823 580.5809 587.6176 616.1451 638.9319 651.3524 704.8560 724.2072 732.1393 741.0855 747.0817 793.4152 816.8343 869.9224 880.7790 895.0084 905.5751 932.0828 953.1566 984.8865 1003.6852 1013.4074 1039.6031 1056.9097 1060.3950 1083.2853 1101.1317 1106.1961 1129.8529 1161.5886 1167.0595 1221.5818 1226.1890 1238.8020 1250.7240 1263.8019 1274.4754 1276.1502 1306.4662 1311.3741 1318.9719 1337.1975 1341.0813 1352.6047 1372.7891 1392.7102 1395.0381 1411.7517 1436.8146 1442.5203 1455.6368 1470.8301 1475.0930 1477.0735 1479.0403 1485.8269 1488.3568 1519.6936 1545.0154 1639.7834 1656.4601 2968.8873 2972.9327 2980.9335 2983.9449 2995.8829 3003.7918 3022.4035 3028.9233 3044.6223 3049.6740 3067.2657 3076.1490 3076.4354 3077.6440 3087.2643 3182.8318 3506.4807 3521.0825
redmass: 3.5952 7.6187 6.2239 5.5242 3.9960 4.0163 4.1339 7.9994 5.3928 3.6101 26.5109 2.8329 28.5799 4.3162 6.1503 24.2167 4.1859 4.6615 4.1346 1.9787 2.7510 1.1491 5.0976 2.2484 5.4892 4.0792 4.7785 3.6650 4.7891 3.6947 3.5715 3.7304 1.3491 4.4076 2.9760 3.3645 3.2297 3.0231 1.8552 7.4198 7.3254 4.6798 3.4287 4.9663 1.6123 1.5985 4.3253 1.7223 1.3693 1.4147 1.9974 1.8165 4.7767 2.3073 3.8907 4.0137 8.6159 2.2752 2.4631 2.1255 1.5835 1.9074 2.2726 2.2511 1.5827 2.1969 1.5810 1.3678 1.4908 2.8064 1.3271 1.2295 1.2337 1.5235 2.7088 1.7977 2.7044 1.4088 1.5763 1.7211 1.2151 1.2261 3.2765 1.9001 1.1523 1.0819 1.0905 1.0494 1.0484 1.0431 1.0810 1.0486 7.5989 9.4783 7.1312 8.2024 1.0575 1.0374 1.0376 1.0594 1.0640 1.0606 1.0979 1.0888 1.0962 1.0999 1.0999 1.0989 1.0992 1.1020 1.1002 1.0933 1.0639 1.0768
irintensity: 0.0223 0.7741 0.1989 0.5208 5.3474 0.4894 0.0485 0.9991 0.6636 1.2744 0.1058 1.1692 0.4994 1.2186 1.4885 0.1373 0.0752 0.6430 1.7208 2.0819 7.4812 0.4278 3.6184 2.3616 2.0844 1.2354 2.2193 0.2702 7.2462 1.5691 2.7086 12.5008 67.4759 5.8506 15.8455 5.6622 19.7160 43.4764 82.3865 11.1988 49.8720 15.4420 38.3140 21.0700 15.7930 3.0047 7.6636 0.9760 3.3778 11.3112 28.4462 8.1100 3.1978 40.1185 20.9931 12.9933 5.5140 132.8578 5.0887 7.2589 18.4136 8.8778 9.1594 47.5045 10.8901 103.9083 9.3782 0.9366 0.1867 22.1322 4.7535 6.3295 25.7974 2.1523 26.1966 26.1825 40.7587 2.3397 14.5184 15.5099 9.5136 19.2649 139.9179 327.0440 49.0330 1.5294 24.4293 3.9146 13.6605 13.1906 14.2455 13.6846 40.6662 24.6279 116.1374 202.5713 12.9324 41.9979 38.6895 19.0276 21.4108 13.8087 13.7064 4.2931 4.2435 0.8831 2.2509 49.8575 44.7334 69.2062 31.6084 0.2343 21.6407 21.1943
temp: 298.150 k
press: 1.00000 atm
elementType: 53 53 53 8 8 8 7 6 6 6 6 6 6 6 6 6 6 6 6 6 6 6 1 1 1 1 1 1 1 1 1 1 1 1 1 1 1 1 1 1
symmnumber: 1
zpe: 789711.5 jmol-1
zpe.correction: 0.300785 hartree
zpe.thermalcorrener: 0.326687 hartree
zpe.thermalcorrenthalpy: 0.327631 hartree
zpe.thermalcorrgfe: 0.237131 hartree
zpe.sumelectzpe: -895.698085 hartree
zpe.sumelectthermal: -895.672183 hartree
zpe.sumelectthermalent: -895.671239 hartree
zpe.sumelectthermalfe: -895.761740 hartree
dipole: -1.7343 1.9010 -3.0634
dipole: 4.0008
quadrupole: -173.3432 -162.7828 -177.0413
quadrupole: -3.3339 5.5021 -5.1795
quadrupole: -2.2875 8.2729 -5.9855 -3.3339 5.5021 -5.1795
hfenergy: -895.9988702 hartree
pointgroup: C01 [X(C15H18I3N1O3)]
dipole: -0.7187387 -0.4646768 1.3209957 debye
polarizability: 342.3359573|5.0206931|275.3379493|8.6050421|-43.5322475|161.7484803 unknown
InChI: InChI=1S/C15H18I3NO3/c1-3-5-12(20)19-14-11(17)7-10(16)9(13(14)18)6-8(4-2)15(21)22/h7-8,19,21H,3-6H2,1-2H3
charge 0 multiplicity 1
40 atoms
I  -0.22703 -1.968772 1.76981
I  3.147555 3.012632 -0.006695
I  -2.875357 3.171066 -0.343334
O  2.675615 -0.280317 -2.059967
O  4.838705 -0.243168 -1.219259
O  -2.956493 -0.205765 -1.515487
N  -2.494986 0.056643 0.759636
C  3.009205 -1.234268 0.134911
C  2.537696 -0.157198 1.179772
C  4.016732 -2.20995 0.79242
C  1.278423 0.600785 0.796359
C  -0.017844 0.026798 0.945501
C  3.634651 -0.55187 -1.076125
C  4.43489 -3.373477 -0.130734
C  1.299873 1.926484 0.274268
C  -1.228653 0.689469 0.592403
C  0.128539 2.626541 -0.078807
C  -1.127524 2.014104 0.091253
C  -4.564769 -1.123237 0.106718
C  -3.289269 -0.388127 -0.314297
C  -5.768019 -0.770493 -0.799555
C  -7.004743 -1.637478 -0.487456
H  2.124491 -1.79469 -0.217159
H  2.359649 -0.702153 2.125202
H  3.369171 0.545598 1.363316
H  4.914114 -1.643346 1.106599
H  3.544909 -2.616062 1.709065
H  3.555321 -3.953588 -0.46805
H  5.113957 -4.06629 0.398005
H  4.967963 -3.001828 -1.023712
H  0.190403 3.646251 -0.462972
H  -2.777073 -0.210866 1.705799
H  -4.810502 -0.919947 1.167922
H  -4.361545 -2.210984 0.024446
H  -6.016064 0.301607 -0.677019
H  -5.45775 -0.901503 -1.851933
H  3.103415 0.206367 -2.816844
H  -6.787697 -2.711126 -0.644357
H  -7.852862 -1.367036 -1.142069
H  -7.335398 -1.510203 0.560928
