program: Gaussian 09
title: 000039282
version: EM64L-G09RevD.01
frameworkgroup: C1[X(C23H30N2O2)]
method: RPBEPBE
basis: SDD
operation: Freq
keyword: #p
keyword: freq=noraman
keyword: PBEPBE/SDD
title: #p freq=noraman PBEPBE/SDD
converged: YES YES NO NO
title: Mulliken charges:
elementType: O O N N C C C C C C C C C C C C C C C C C C C C C C C H H H H H H H H H H H H H H H H H H H H H H H H H H H H H H
charge: -0.268295 -0.211608 -0.182895 -0.120687 0.001054 0.213023 0.265208 0.031721 -0.396634 -0.407789 0.381421 -0.360203 -0.390424 -0.355115 -0.360208 -0.380445 -0.259571 -0.221952 -0.220638 -0.319250 -0.320389 -0.233761 -0.246183 -0.686967 -0.239218 -0.678947 -0.675447 0.203248 0.285980 0.217266 0.216969 0.202607 0.196235 0.265378 0.244480 0.267816 0.246067 0.230772 0.225499 0.210810 0.202409 0.206864 0.191000 0.209226 0.184323 0.223337 0.223138 0.203388 0.226966 0.230998 0.225354 0.261316 0.201338 0.200231 0.229399 0.201811 0.209971
chargesum: 0.00000
title: Mulliken charges with hydrogens summed into heavy atoms:
elementType: O O N N C C C C C C C C C C C C C C C C C C C C C C C
charge: -0.268295 -0.211608 -0.182895 -0.120687 0.001054 0.213023 0.265208 0.031721 0.092595 0.026446 0.381421 0.038639 -0.125046 -0.110635 -0.092392 -0.134378 -0.028799 0.003548 0.192582 0.078614 0.073159 -0.010423 -0.023045 -0.025615 -0.013864 -0.016062 -0.034266
polarizability: 2.78825449e+02 8.41016842e+00 2.93327679e+02 8.88729213e+00 -1.73872098e+01 2.32600404e+02
1716.lowfreq: -9.1952 -7.1380 -2.2627 -0.0001 0.0004 0.0006 11.6017 17.5639 19.9418
frequency: 10.8846 17.5179 19.8733 26.5652 38.7493 50.3440 51.5674 62.2234 70.0167 78.2539 83.0983 90.5613 95.2660 128.3721 171.6841 186.8224 204.7778 212.5682 222.7355 225.7598 236.7566 257.9332 272.1696 276.5418 286.0257 293.5687 313.5703 315.7768 333.1113 361.5434 385.6482 403.5477 422.4243 451.6013 457.4830 472.1162 486.6647 498.9666 517.0290 588.1668 599.1982 615.4237 641.0646 664.2531 683.8315 699.7471 700.6439 709.9307 745.3979 760.1136 763.4303 772.7683 791.2784 795.8192 822.5375 840.8863 853.5053 855.6356 861.2746 866.9754 907.6129 918.1001 933.0595 935.7341 944.3588 959.5951 979.2388 981.5412 988.5948 990.7337 996.9004 1018.0171 1022.2936 1028.7488 1039.4807 1052.7006 1061.1589 1071.4512 1075.3788 1081.0891 1085.9613 1086.6766 1097.4882 1115.6223 1117.8377 1137.2231 1147.7340 1165.6533 1171.8228 1178.1135 1189.1540 1195.4145 1209.5527 1239.6259 1248.8449 1253.8747 1259.8750 1281.7613 1285.1308 1296.8758 1308.7680 1317.8005 1326.8242 1333.0755 1355.1261 1357.9101 1362.6710 1369.9476 1375.3359 1381.9042 1387.1260 1391.9412 1393.0184 1406.3061 1433.8392 1452.8222 1459.4479 1460.0623 1461.3551 1465.9924 1473.8724 1474.6748 1477.4467 1478.7835 1479.3750 1481.9736 1483.4667 1489.4741 1489.6884 1491.0676 1591.0484 1601.0722 1610.6354 1619.9892 1649.2494 2846.2992 2856.3573 2874.2054 2950.4621 2978.1547 2981.7424 2988.6592 2993.1401 2997.7621 3005.4451 3020.5741 3028.0576 3031.7855 3046.0695 3070.1235 3073.7901 3077.9082 3089.6002 3090.2835 3093.0326 3101.4083 3122.0425 3130.4155 3133.4593 3141.9924 3146.5579 3153.4962 3159.8633 3167.4721 3181.1472
redmass: 3.5238 4.5294 3.9434 3.7703 3.6847 2.5080 2.5584 3.3377 4.6373 2.1860 2.8700 3.6876 2.4651 6.7286 2.6345 2.1692 2.0807 2.5887 1.2643 1.9882 3.4765 2.4835 2.4907 2.1530 2.9641 2.7209 3.3629 3.8282 2.5152 3.9546 4.2541 2.8396 2.9265 3.6979 2.5492 6.6413 3.4136 3.9483 4.4292 4.7406 4.9360 6.4170 5.5151 4.7780 6.2193 2.2255 2.1726 3.6467 3.2040 1.4723 2.0907 1.5063 1.2243 1.1437 1.1009 2.5611 1.7524 1.3655 2.0380 2.0037 2.4621 1.9724 2.5387 1.8266 1.7676 2.6693 1.3454 1.3731 4.2687 5.6942 1.3587 2.2423 2.5211 2.1850 3.4693 4.0533 2.3571 2.2874 1.8658 2.6424 1.8008 2.0747 1.9614 2.2317 1.8131 1.4500 1.5894 1.4382 1.0523 1.6504 1.1626 1.9735 2.2587 2.0461 2.0368 1.6608 1.1505 1.2160 1.2627 1.2630 1.3845 1.3380 1.9411 2.4743 1.4730 1.3336 1.3401 1.2795 1.3570 8.6021 1.2390 1.2221 1.2718 4.7083 2.2325 2.3060 1.0410 1.1038 1.0862 1.0591 1.0815 1.2597 1.9432 1.0631 1.0978 1.6478 1.3620 1.0750 1.0744 1.0804 6.2397 7.5472 6.1817 7.6381 10.3479 1.0721 1.0716 1.0714 1.0548 1.0360 1.0358 1.0603 1.0358 1.0635 1.1072 1.0883 1.0873 1.0888 1.0970 1.0984 1.0981 1.1017 1.1004 1.0988 1.1010 1.1012 1.0846 1.0854 1.0888 1.0899 1.0938 1.0949 1.0991 1.1002 1.0957
irintensity: 0.0610 0.1966 0.2108 0.2489 0.2380 0.0309 0.2338 0.6047 1.6208 0.1910 2.5108 0.5517 0.3566 2.3150 0.1932 2.2738 1.2487 0.9924 0.5212 0.7378 0.6694 3.6789 0.5653 1.8452 8.7890 1.4512 4.0583 0.8613 0.0660 6.7873 1.5039 0.2097 5.7235 6.3800 5.9106 3.1170 13.3544 2.0980 2.1673 1.3471 15.9385 0.0147 6.6245 6.1214 2.2769 26.2760 22.8177 15.9928 7.8530 70.0636 54.1151 3.4582 13.3259 3.7938 2.2183 5.5719 2.1640 0.1249 5.6847 2.6380 4.4603 0.6306 23.2074 0.6063 9.3964 1.3087 0.8941 0.1930 35.2757 10.8979 1.1529 13.8369 3.7716 11.3176 50.6076 57.2462 14.5640 29.4841 29.9951 28.7109 4.6877 6.1495 3.6495 9.3889 9.4118 3.8038 25.3869 8.9218 0.2361 15.3111 15.9507 66.8766 46.1494 6.1197 3.9944 7.7824 0.4095 11.7158 3.5264 23.1972 9.8394 1.5309 78.3034 57.0146 0.2930 7.9627 2.3939 4.0687 0.3586 0.0058 20.6222 22.0265 26.2732 9.4351 12.8817 38.8018 13.8480 8.9799 0.1015 4.2493 4.2458 5.3736 70.2338 5.1038 16.4332 25.1291 56.3368 0.6548 11.1579 17.6887 0.5496 57.7304 6.3886 145.7077 128.4396 59.4318 93.1331 221.1216 43.6112 35.6634 24.5167 18.4204 28.6681 32.3032 25.8876 11.6740 5.9213 30.5540 34.9887 48.6592 73.6380 11.8265 38.0946 31.8343 28.3891 29.6710 0.1156 2.4718 9.3321 10.9275 33.5463 22.5092 29.9941 22.0281 4.9692
temp: 298.150 k
press: 1.00000 atm
elementType: 8 8 7 7 6 6 6 6 6 6 6 6 6 6 6 6 6 6 6 6 6 6 6 6 6 6 6 1 1 1 1 1 1 1 1 1 1 1 1 1 1 1 1 1 1 1 1 1 1 1 1 1 1 1 1 1 1
symmnumber: 1
zpe: 1260244.5 jmol-1
zpe.correction: 0.480002 hartree
zpe.thermalcorrener: 0.507722 hartree
zpe.thermalcorrenthalpy: 0.508666 hartree
zpe.thermalcorrgfe: 0.417531 hartree
zpe.sumelectzpe: -1152.370902 hartree
zpe.sumelectthermal: -1152.343182 hartree
zpe.sumelectthermalent: -1152.342238 hartree
zpe.sumelectthermalfe: -1152.433372 hartree
dipole: 2.1476 3.6762 -0.3765
dipole: 4.2741
quadrupole: -151.5497 -155.0335 -154.8534
quadrupole: 1.8002 2.2759 -0.7856
quadrupole: 2.2625 -1.2213 -1.0412 1.8002 2.2759 -0.7856
hfenergy: -1152.8509033 hartree
pointgroup: C01 [X(C23H30N2O2)]
dipole: 0.9142383 1.4027652 -0.1551817 debye
polarizability: 279.6890552|9.0997562|292.310647|7.9556228|-18.0795999|232.753829 unknown
InChI: InChI=1S/C23H30N2O2/c1-4-24(5-2)17-12-18-25-21-16-11-10-15-20(21)23(22(25)26,27-6-3)19-13-8-7-9-14-19/h7-11,13-16H,4-6,12,17-18H2,1-3H3
charge 0 multiplicity 1
57 atoms
O  -2.026761 -0.155349 1.867531
O  0.45447 -1.517914 0.630973
N  0.609886 0.651766 -0.298509
N  4.711338 -0.553051 0.035721
C  -1.583763 0.005198 0.472191
C  -1.55312 1.453814 0.000043
C  -0.245859 1.777705 -0.448656
C  -0.066425 -0.423922 0.297168
C  2.039169 0.607264 -0.636911
C  2.950294 1.19171 0.46746
C  -2.461903 -0.932428 -0.363809
C  4.441569 0.898325 0.173218
C  -2.570873 2.415742 -0.034845
C  0.068716 3.05412 -0.950997
C  -2.811832 -2.198317 0.169515
C  -2.872633 -0.593087 -1.676083
C  -2.274009 3.713006 -0.531901
C  -0.969671 4.019954 -0.986974
C  -1.175178 0.511789 2.876632
C  4.711267 -1.287828 1.332397
C  5.896588 -0.867872 -0.80303
C  -3.57837 -3.102969 -0.595615
C  -3.634323 -1.503708 -2.442673
C  -1.853828 0.296591 4.228733
C  -3.991854 -2.760556 -1.904736
C  4.156933 -2.719951 1.1987
C  5.651761 -0.654582 -2.309784
H  2.195054 1.135648 -1.596997
H  2.320473 -0.450225 -0.779114
H  2.808076 2.285863 0.5674
H  2.65985 0.738886 1.434083
H  5.06932 1.371323 0.970402
H  4.720615 1.391045 -0.777459
H  -3.577165 2.163771 0.316498
H  1.075525 3.304214 -1.300024
H  -2.484495 -2.453632 1.180401
H  -2.605247 0.381261 -2.098952
H  -3.056646 4.478056 -0.565408
H  -0.753191 5.022792 -1.372333
H  -0.162901 0.05696 2.864237
H  -1.086564 1.592835 2.640755
H  4.075561 -0.732513 2.046013
H  5.736865 -1.308993 1.777935
H  6.142825 -1.932942 -0.637688
H  6.795819 -0.282736 -0.47925
H  -3.849163 -4.077099 -0.172856
H  -3.949265 -1.230179 -3.456103
H  -1.257358 0.762076 5.034779
H  -2.862159 0.74524 4.233707
H  -1.952463 -0.781301 4.443919
H  -4.584133 -3.466115 -2.498634
H  3.103689 -2.688023 0.870192
H  4.732429 -3.31044 0.462239
H  4.209103 -3.24925 2.169172
H  4.792756 -1.263114 -2.642698
H  5.436767 0.402471 -2.5517
H  6.544437 -0.95243 -2.890973
