program: Gaussian 09
title: 000005619
version: EM64L-G09RevD.01
frameworkgroup: C1[X(C19H26Cl2N2O)]
method: RPBEPBE
basis: SDD
operation: Freq
keyword: #p
keyword: freq=noraman
keyword: PBEPBE/SDD
title: #p freq=noraman PBEPBE/SDD
converged: YES YES NO NO
title: Mulliken charges:
elementType: Cl Cl O N N C C C C C C C C C C C C C C C C C C C H H H H H H H H H H H H H H H H H H H H H H H H H H
charge: -0.029904 -0.018589 -0.291927 -0.142670 -0.123260 -0.023013 -0.082934 -0.456736 -0.428684 -0.393905 -0.391393 -0.379244 -0.360040 -0.441874 -0.464391 -0.667485 0.280402 -0.716307 0.556479 -0.449023 -0.349923 -0.053114 -0.219780 -0.115045 0.263106 0.189637 0.205280 0.196475 0.190989 0.257083 0.203675 0.194069 0.184739 0.201750 0.181395 0.233542 0.206648 0.195078 0.213519 0.225818 0.218235 0.207652 0.253455 0.247341 0.227627 0.248748 0.243512 0.256552 0.260911 0.255524
chargesum: 0.00000
title: Mulliken charges with hydrogens summed into heavy atoms:
elementType: Cl Cl O N N C C C C C C C C C C C C C C C C C C C
charge: -0.029904 -0.018589 -0.291927 -0.142670 -0.123260 0.240093 0.106703 -0.054980 0.019388 0.003839 -0.004904 0.035693 0.041687 -0.002538 -0.038504 0.060939 0.280402 -0.224047 0.556479 -0.192472 -0.089012 -0.053114 0.035744 -0.115045
polarizability: 2.88129663e+02 1.74580263e+01 2.34051874e+02 -2.73359825e+01 1.29271155e+01 1.83104070e+02
1716.lowfreq: -19.2392 -7.6098 0.0013 0.0014 0.0019 2.4976 12.2321 17.0942 32.5901
frequency: -9.8953 15.6864 32.4032 48.2306 54.6820 65.4381 75.5427 86.1077 97.8089 106.6545 134.1451 139.3690 155.8563 167.1302 181.5339 202.3389 218.9495 221.7097 230.8052 258.8072 272.8384 305.4731 322.3098 330.0083 362.7125 395.3432 409.8038 431.0290 438.6827 440.7120 453.2192 457.4635 485.7354 530.0374 563.0215 575.0224 608.9962 621.0491 654.7098 674.1768 684.5213 700.9277 757.8665 775.9502 794.9391 824.8460 834.2774 845.7058 852.7251 865.1236 874.0656 877.4283 893.9908 897.1784 933.8937 943.0704 952.6843 954.6658 965.1705 969.3686 1002.9047 1018.4789 1041.0772 1051.8805 1061.2193 1082.6665 1090.2382 1096.3139 1102.2089 1109.3564 1121.3258 1122.6884 1135.0077 1146.6085 1151.6536 1184.7654 1187.1798 1188.9592 1196.4469 1205.9352 1215.7523 1223.6078 1239.3502 1249.5102 1254.4967 1260.1108 1273.8724 1281.0788 1286.2310 1287.5264 1308.9103 1312.2572 1319.2959 1326.8160 1336.0666 1338.5735 1343.6954 1347.6632 1373.1722 1386.7040 1392.1027 1399.4470 1433.5673 1449.3863 1459.2888 1464.2424 1465.0409 1465.6570 1472.3264 1479.9616 1480.7508 1482.5431 1486.9421 1492.8948 1498.7576 1572.2444 1586.6978 1600.7966 2856.5677 2867.1189 2961.5899 2961.8576 2963.7588 2964.8938 2973.4861 2974.5765 2994.4727 3004.0976 3015.5687 3016.0559 3025.0024 3029.3683 3030.9432 3036.7338 3036.9993 3040.6168 3057.5872 3063.3958 3070.7542 3087.9472 3100.5733 3148.6467 3160.4222 3183.5920
redmass: 7.1190 5.4845 5.6655 2.8265 4.9020 3.1494 3.2124 1.9972 3.5109 3.6990 2.4491 1.9593 2.7693 5.6376 9.3850 4.4760 4.0702 2.4165 2.5980 4.5104 3.7702 2.1925 4.4560 2.4712 5.2263 3.4406 3.7195 5.3003 3.2305 3.2128 5.1166 2.9636 2.6061 3.5631 3.7065 3.9842 4.7327 2.5044 6.4079 3.1397 4.8594 4.1255 1.5923 2.1088 1.8222 1.7712 1.8381 2.0929 2.1739 2.3727 1.7935 1.6464 2.4173 2.3154 2.1059 1.7701 2.3904 1.6751 1.8902 1.5653 5.3673 3.1769 1.7353 1.4962 2.4136 1.8806 1.5624 1.4115 2.2623 2.4370 2.0886 2.0014 2.0490 1.5179 2.7253 1.3395 1.4368 1.4815 1.7136 1.5464 1.7720 1.4854 1.3777 1.4590 1.4879 1.5660 1.6674 1.2576 1.3500 1.3224 1.4984 1.3417 1.3646 1.3890 1.4387 1.4990 1.5343 1.4569 7.8049 2.1997 1.6515 1.3241 1.2547 1.2178 1.0908 1.1178 2.4030 1.1067 1.0866 1.0865 1.0897 1.0866 1.0712 1.0839 1.0986 7.3654 6.7949 6.9308 1.0710 1.0705 1.0468 1.0609 1.0611 1.0634 1.0704 1.0725 1.0641 1.0642 1.0804 1.0820 1.0765 1.0951 1.0954 1.0881 1.0947 1.1012 1.0937 1.1036 1.0996 1.1054 1.0989 1.0923 1.0892 1.0967
irintensity: 0.0984 0.0409 0.0477 0.3151 1.2213 4.3826 0.6317 0.2812 4.2059 0.4086 1.2178 1.2639 0.6683 0.3063 0.5570 1.8682 1.3979 0.7946 1.0629 2.9771 4.1314 1.3530 0.4940 12.6883 1.1221 11.6865 13.1680 4.7285 6.0354 1.5599 18.1968 2.6207 7.3443 0.0971 8.2579 12.5075 10.3648 0.3804 10.2889 0.9392 5.2552 10.6706 0.7018 8.2715 14.2919 10.8082 7.5596 15.2573 4.5478 12.6204 29.2250 14.1113 3.7111 4.0764 2.3829 10.7627 8.8770 8.9792 2.5519 1.1852 33.2110 5.0600 2.5939 0.6608 5.3393 112.1305 7.7348 7.9980 2.7601 17.8142 33.5357 8.0722 36.8523 0.7402 31.3178 11.2051 4.8592 0.7127 6.9188 0.7728 7.3198 14.7901 3.7618 10.4967 22.2221 3.1908 34.6281 1.6751 0.9897 3.9825 43.3778 0.6803 13.8068 2.8707 15.2079 54.9990 38.9851 5.3687 0.5519 17.7281 39.7903 3.3210 2.7328 42.2287 3.2661 7.4983 71.6144 8.7095 14.5695 11.2501 7.8558 3.1695 23.3413 15.1460 0.1234 12.7130 173.0111 13.9461 59.6717 141.6151 38.2238 44.9779 32.5278 12.2325 49.5471 30.6099 38.2847 13.4871 18.2735 68.4861 51.5167 72.2242 31.7619 11.8500 11.4762 64.3717 26.7767 8.6151 28.4861 83.3265 29.4010 2.8973 2.0483 3.0409
temp: 298.150 k
press: 1.00000 atm
elementType: 17 17 8 7 7 6 6 6 6 6 6 6 6 6 6 6 6 6 6 6 6 6 6 6 1 1 1 1 1 1 1 1 1 1 1 1 1 1 1 1 1 1 1 1 1 1 1 1 1 1
symmnumber: 1
zpe: 1092159.6 jmol-1
zpe.correction: 0.415982 hartree
zpe.thermalcorrener: 0.439271 hartree
zpe.thermalcorrenthalpy: 0.440215 hartree
zpe.thermalcorrgfe: 0.361585 hartree
zpe.sumelectzpe: -1842.631566 hartree
zpe.sumelectthermal: -1842.608277 hartree
zpe.sumelectthermalent: -1842.607333 hartree
zpe.sumelectthermalfe: -1842.685963 hartree
dipole: -5.9740 0.4078 3.1901
dipole: 6.7846
quadrupole: -170.3673 -153.3868 -151.2130
quadrupole: -5.6037 0.2400 -0.8674
quadrupole: -12.0449 4.9355 7.1094 -5.6037 0.2400 -0.8674
hfenergy: -1843.0475479 hartree
pointgroup: C01 [X(C19H26Cl2N2O1)]
dipole: -2.2827451 0.5564666 -1.2666678 debye
polarizability: 275.4860429|-31.9710746|242.1973747|28.5524947|13.0935478|187.602189 unknown
InChI: InChI=1S/C19H26Cl2N2O/c1-22(19(24)13-14-8-9-15(20)16(21)12-14)17-6-2-3-7-18(17)23-10-4-5-11-23/h8-9,12,17-18H,2-7,10-11,13H2,1H3
charge 0 multiplicity 1
50 atoms
Cl 4.895988 -3.355111 -0.402327
Cl 6.483463 -1.02457 1.312485
O  0.292331 1.230183 0.478005
N  -2.727631 -0.904333 0.163451
N  -1.160695 1.034391 -1.334616
C  -2.647817 0.493896 0.651951
C  -2.338084 1.476138 -0.522257
C  -3.903883 0.991699 1.426168
C  -2.183337 2.937698 -0.02663
C  -3.723997 2.43939 1.939362
C  -3.430015 3.398701 0.762489
C  -2.386743 -1.96388 1.147781
C  -3.959387 -1.372087 -0.515875
C  -2.735909 -3.29228 0.412669
C  -3.642355 -2.862375 -0.790669
C  -1.45994 0.501015 -2.676705
C  0.073284 0.871283 -0.724479
C  1.191606 0.246376 -1.598813
C  2.473957 -0.064081 -0.848322
C  3.027226 -1.364381 -0.919272
C  3.161643 0.926691 -0.101665
C  4.241032 -1.667391 -0.267857
C  4.374758 0.625152 0.548501
C  4.918994 -0.674313 0.465411
H  -1.780302 0.538321 1.336875
H  -3.204493 1.447502 -1.21563
H  -4.107702 0.304658 2.271041
H  -4.792131 0.957431 0.761707
H  -2.011057 3.59714 -0.899374
H  -1.287703 2.997705 0.615961
H  -2.882691 2.475972 2.6607
H  -4.631427 2.764795 2.484391
H  -4.313603 3.431654 0.090458
H  -3.273024 4.429323 1.134518
H  -2.993474 -1.882204 2.084085
H  -1.321916 -1.890775 1.431572
H  -4.155297 -0.796882 -1.440002
H  -4.869856 -1.292781 0.129014
H  -3.258894 -3.990955 1.088848
H  -1.825425 -3.799747 0.051453
H  -3.0868 -2.959369 -1.740215
H  -4.560619 -3.470296 -0.871149
H  -1.791713 -0.555166 -2.618673
H  -0.58693 0.569849 -3.344142
H  -2.268185 1.098657 -3.132496
H  0.809778 -0.676814 -2.072025
H  1.408205 0.952268 -2.428052
H  2.518233 -2.154938 -1.480487
H  2.735729 1.928586 -0.008218
H  4.903305 1.388557 1.126854
