program: Gaussian 09
title: 000039188
version: EM64L-G09RevD.01
frameworkgroup: C1[X(C21H29NO2)]
method: RPBEPBE
basis: SDD
operation: Freq
keyword: #p
keyword: freq=noraman
keyword: PBEPBE/SDD
title: #p freq=noraman PBEPBE/SDD
converged: YES YES NO NO
title: Mulliken charges:
elementType: O O N C C C C C C C C C C C C C C C C C C C C C H H H H H H H H H H H H H H H H H H H H H H H H H H H H H
charge: -0.456341 -0.437463 -0.110004 0.225037 0.176031 -0.170022 -0.502319 -0.578723 -0.517058 0.343603 -0.350240 -0.604705 -0.393906 -0.433182 0.313579 -0.416760 -0.066789 -0.476936 -0.501117 -0.593730 -0.433840 -0.386672 0.269439 -0.396052 0.230047 0.203649 0.223921 0.206920 0.208432 0.219972 0.237377 0.195323 0.212267 0.224160 0.226452 0.223512 0.198055 0.180160 0.219933 0.193887 0.200282 0.231026 0.320573 0.232323 0.202457 0.206296 0.222621 0.217452 0.217565 0.209625 0.234951 0.249747 0.349182
chargesum: 0.00000
title: Mulliken charges with hydrogens summed into heavy atoms:
elementType: O O N C C C C C C C C C C C C C C C C C C C C C
charge: -0.135768 -0.088281 -0.110004 0.225037 0.176031 0.060025 -0.074749 -0.163371 -0.059708 0.343603 0.057350 -0.154093 0.027661 -0.033089 0.313579 -0.022592 0.164237 -0.042155 -0.072199 -0.376278 -0.006649 -0.151720 0.269439 -0.146306
polarizability: 2.49704405e+02 8.44518731e+00 2.39917342e+02 -1.66638796e+01 5.35283139e+00 1.95343253e+02
1716.lowfreq: -14.6220 -9.8922 -0.0004 0.0003 0.0005 3.4189 14.8425 39.1236 58.5007
frequency: 12.7992 38.4128 58.4261 65.7521 88.9065 106.9482 122.2801 147.7923 164.8271 175.5344 200.1088 217.9679 224.9796 234.5418 263.2184 282.6998 297.9877 316.0278 326.3594 336.1856 345.7646 359.2097 376.6145 399.2480 408.5233 421.4925 430.6114 458.8264 461.6593 474.6678 479.3362 523.8992 550.3345 570.7579 611.3135 633.6362 640.1878 671.9420 686.6949 712.4371 736.5815 746.8262 765.1124 781.3368 788.5302 814.7790 820.2325 833.4139 849.0580 854.8035 868.4445 876.4281 886.2651 897.5524 930.2342 936.4271 948.5252 950.5525 954.3132 955.7343 965.6245 972.5822 1000.1843 1004.9750 1035.4453 1043.6313 1054.0545 1064.3367 1075.5551 1089.8233 1096.6544 1107.7373 1118.5969 1123.8737 1129.4130 1140.2180 1148.8345 1162.1185 1166.2310 1172.3953 1178.0431 1186.8309 1201.4884 1205.9889 1210.4709 1226.8819 1230.0378 1232.3817 1235.0455 1240.4874 1246.3039 1257.8019 1265.3059 1269.2686 1273.9902 1284.9308 1295.9496 1303.5346 1319.5649 1324.5377 1330.4416 1334.2928 1339.1426 1342.3458 1353.1606 1360.6900 1377.2608 1379.8934 1392.2730 1422.7368 1446.3550 1453.3442 1458.2712 1459.9834 1464.0270 1466.2893 1468.0023 1478.0007 1479.2126 1483.7076 1489.1741 1497.7773 1600.4868 1616.1783 2830.6736 2920.7752 2927.6866 2940.0842 2960.6435 2963.5873 2981.6069 2987.5238 2990.8057 2996.9402 2997.1089 3005.6227 3011.3665 3015.7364 3019.2196 3024.0806 3024.2729 3029.8038 3041.4038 3051.1869 3066.7700 3068.1100 3077.9562 3097.2419 3107.8084 3119.1698 3171.3092 3556.7456 3578.4695
redmass: 4.7170 3.0292 4.0303 2.8449 3.3764 3.6307 2.3083 2.8807 1.5566 2.5272 2.4100 3.2309 4.0311 3.3970 3.2300 2.6567 2.8331 2.5109 3.8400 1.1545 3.1745 3.6995 2.2416 2.2144 3.1525 2.7550 3.4991 3.2542 5.3077 2.4857 3.3784 3.1117 2.2174 3.7449 3.6453 2.8583 2.1278 5.9596 4.0920 2.9350 4.2442 2.1315 1.7836 2.2007 1.3928 1.6067 1.6517 1.7196 1.7569 2.6163 2.1762 2.4910 1.9863 1.8492 1.9060 1.9358 2.4668 1.9738 1.7917 1.4352 2.1342 2.4242 2.2213 2.2270 2.3116 2.3926 2.1520 1.9968 3.2808 1.6571 1.9130 2.3301 2.4977 2.2248 1.8369 1.9310 1.4354 2.1902 1.6124 1.4358 1.7124 1.3121 1.6641 1.4108 1.1754 1.8216 1.4662 1.3666 1.4117 1.4859 1.4226 1.7860 1.5479 1.3224 1.6301 1.5576 1.4459 1.6286 1.4592 1.3632 1.3538 1.4606 1.4562 1.4425 1.4814 1.6929 1.5608 3.6424 1.4764 3.1370 1.0934 1.0866 1.1174 1.0856 1.0885 1.0843 1.0930 1.0992 1.1254 1.1011 1.2285 2.0025 6.6139 6.6229 1.0698 1.0731 1.0770 1.0691 1.0678 1.0658 1.0614 1.0620 1.0842 1.0624 1.0600 1.0649 1.0829 1.0689 1.0849 1.0934 1.0933 1.0905 1.1032 1.1017 1.0994 1.1052 1.1053 1.1062 1.0891 1.0895 1.0952 1.0653 1.0659
irintensity: 0.0778 0.1132 0.2162 0.0931 0.8116 0.1553 0.0095 0.7173 60.7656 30.3350 15.0440 0.7079 0.9126 3.8100 1.3280 1.0200 0.4244 2.1808 7.6071 116.6349 13.6113 0.2395 0.0780 1.4181 1.7884 2.9002 7.2441 3.8560 21.3043 5.5288 7.8908 6.1943 2.6880 1.1990 5.0339 2.9171 6.0028 4.5296 1.2909 4.0858 13.4229 1.9071 3.4491 5.6036 5.0149 15.2863 14.3393 12.4461 19.6351 6.8611 5.1044 15.4355 9.5166 5.1665 8.5486 8.0117 33.9364 8.9479 1.0362 0.6967 2.0316 16.9044 1.0097 4.8960 23.7940 0.6076 12.5237 11.8096 30.0695 9.3090 11.5740 3.4445 44.0648 48.2101 53.8505 102.7041 26.8578 54.5289 4.7496 5.1176 8.4873 5.3498 8.0436 17.2279 1.9667 2.3138 5.0152 3.9502 4.1528 7.0833 4.3576 15.2232 16.9221 4.8023 3.3705 16.1392 10.1438 13.6339 12.4475 3.1044 4.0976 1.4702 6.6182 1.9810 5.8995 9.0681 5.7943 3.3177 1.1187 33.5713 15.3379 6.8729 4.1802 1.5276 9.5261 7.8535 11.7137 6.0713 3.5416 12.8128 38.0953 47.6388 10.6324 70.6280 111.6674 45.1643 65.6046 50.9736 54.4713 27.1218 27.5682 42.9210 5.6311 18.0132 64.4854 51.7273 6.8367 56.6190 64.7548 37.6083 42.7967 50.1278 46.5238 43.5543 37.2605 25.9579 19.1381 90.3570 23.0427 12.2863 9.6651 0.9726 30.6289
temp: 298.150 k
press: 1.00000 atm
elementType: 8 8 7 6 6 6 6 6 6 6 6 6 6 6 6 6 6 6 6 6 6 6 6 6 1 1 1 1 1 1 1 1 1 1 1 1 1 1 1 1 1 1 1 1 1 1 1 1 1 1 1 1 1
symmnumber: 1
zpe: 1201122.2 jmol-1
zpe.correction: 0.457483 hartree
zpe.thermalcorrener: 0.479237 hartree
zpe.thermalcorrenthalpy: 0.480182 hartree
zpe.thermalcorrgfe: 0.407329 hartree
zpe.sumelectzpe: -1020.965351 hartree
zpe.sumelectthermal: -1020.943596 hartree
zpe.sumelectthermalent: -1020.942652 hartree
zpe.sumelectthermalfe: -1021.015505 hartree
dipole: 1.7433 -1.9430 -0.5885
dipole: 2.6760
quadrupole: -139.0470 -153.4073 -135.6186
quadrupole: -8.0297 -7.0390 -0.9245
quadrupole: 3.6440 -10.7164 7.0724 -8.0297 -7.0390 -0.9245
hfenergy: -1021.4228339 hartree
pointgroup: C01 [X(C21H29N1O2)]
dipole: -0.4604141 -0.9354495 0.1460955 debye
polarizability: 251.5371951|-3.3687149|238.0159766|-18.1690496|-4.2220594|195.4118275 unknown
InChI: InChI=1S/C21H29NO2/c23-17-7-6-16-12-19-21(24)9-2-1-8-20(21,18(16)13-17)10-11-22(19)14-15-4-3-5-15/h6-7,13,15,19,23-24H,1-5,8-12,14H2
charge 0 multiplicity 1
53 atoms
O  0.570774 -3.12268 -0.182801
O  -3.880885 2.72427 1.479693
N  1.839125 -0.423464 0.039807
C  -0.850168 -1.225062 0.673921
C  -0.148663 -1.877818 -0.566548
C  0.948686 -0.90799 -1.06204
C  0.205874 -1.033983 1.830126
C  -1.98356 -2.177756 1.165335
C  -1.174613 -2.240321 -1.675524
C  -1.384589 0.172835 0.25692
C  1.677673 -1.079239 1.356577
C  0.278211 0.32218 -1.714711
C  -3.00843 -2.537739 0.066487
C  -2.299794 -3.168875 -1.155126
C  -0.822955 0.901195 -0.833141
C  3.248748 -0.273353 -0.386825
C  4.029696 0.778917 0.411499
C  3.633918 2.28719 0.243941
C  5.474657 1.135697 -0.096385
C  -2.404697 0.788031 1.029254
C  5.159905 2.64893 0.179875
C  -1.303026 2.20707 -1.10832
C  -2.868889 2.086773 0.731862
C  -2.319884 2.811276 -0.348418
H  1.540377 -1.461535 -1.825343
H  0.065917 -1.827729 2.589409
H  0.004391 -0.066484 2.324034
H  -2.49309 -1.745003 2.046767
H  -1.50419 -3.108311 1.536368
H  -0.630763 -2.715515 -2.514759
H  -1.652181 -1.323871 -2.062747
H  2.29689 -0.528651 2.088997
H  2.033689 -2.133562 1.335592
H  -0.12722 0.058709 -2.714143
H  1.056002 1.090239 -1.885461
H  -3.543194 -1.622805 -0.255419
H  -3.76985 -3.232306 0.470999
H  -1.89817 -4.169229 -0.879534
H  -3.024191 -3.356392 -1.970183
H  3.796505 -1.251991 -0.341068
H  3.250921 0.039871 -1.450038
H  4.064846 0.506659 1.48329
H  -0.096734 -3.842354 -0.051464
H  3.031488 2.746139 1.044192
H  3.11936 2.457777 -0.719791
H  5.587113 0.928109 -1.177298
H  6.329222 0.688683 0.439079
H  -2.838434 0.251252 1.883067
H  5.475816 3.376562 -0.586181
H  5.54844 2.977971 1.160125
H  -0.859155 2.766816 -1.941075
H  -2.685666 3.819345 -0.563039
H  -4.186754 2.142219 2.218965
