program: Gaussian 09
title: 000039145
version: EM64L-G09RevD.01
frameworkgroup: C1[X(C7H14)]
method: RPBEPBE
basis: SDD
operation: Freq
keyword: #p
keyword: freq=noraman
keyword: PBEPBE/SDD
title: #p freq=noraman PBEPBE/SDD
converged: YES YES NO NO
title: Mulliken charges:
elementType: C C C C C C C H H H H H H H H H H H H H H
charge: -0.135696 -0.175650 -0.689661 -0.689415 -0.190436 -0.437238 -0.670306 0.203276 0.229426 0.204129 0.225050 0.210897 0.210987 0.225517 0.204432 0.220465 0.206450 0.201817 0.210125 0.214052 0.221779
chargesum: 0.00000
title: Mulliken charges with hydrogens summed into heavy atoms:
elementType: C C C C C C C
charge: 0.067580 0.053776 -0.049585 -0.048479 0.030029 -0.028971 -0.024351
polarizability: 1.03134663e+02 2.17269261e+00 6.56214164e+01 4.57445788e+00 1.75999340e-01 6.61562622e+01
1716.lowfreq: -13.2892 -0.0007 -0.0006 0.0003 6.9676 14.4492 47.2709 102.9695 115.6557
frequency: 47.0598 102.9346 115.6490 161.7620 196.8380 225.3088 258.1712 291.9963 341.4631 438.5936 447.6956 493.3392 768.3959 829.1340 839.8687 894.9551 913.7135 941.8652 951.2303 974.7929 1026.9976 1067.3380 1100.2973 1109.3237 1166.4757 1186.5240 1234.6831 1263.7383 1287.8882 1301.7791 1308.6681 1349.6907 1371.6017 1384.8265 1389.9734 1464.2462 1464.4729 1467.1422 1474.4295 1476.7285 1484.2919 1485.8553 1682.4784 2963.2117 2967.7371 2970.7692 2976.2076 2978.9413 3023.6421 3050.9184 3058.9860 3063.1917 3068.2711 3073.0945 3075.7539 3080.4169 3081.6996
redmass: 2.4096 2.6204 2.5022 1.4846 1.0305 1.0769 1.3819 2.3299 2.0525 2.7152 2.4141 2.7829 1.2236 1.8279 2.1473 1.6511 1.1852 1.8509 1.4443 1.1048 1.8358 1.7890 1.9267 2.4590 2.0188 1.8912 1.3217 1.2124 1.2902 1.3405 1.3806 1.4900 1.2002 1.2036 1.2089 1.0460 1.0720 1.0521 1.0428 1.0467 1.0622 1.0579 6.7549 1.0618 1.0350 1.0354 1.0357 1.0840 1.0968 1.0921 1.0998 1.0922 1.0970 1.0978 1.1003 1.0993 1.1007
irintensity: 0.1381 0.5781 0.3469 0.3064 0.0015 0.0085 0.3952 0.0788 0.1838 1.4919 0.1389 1.1319 7.1525 0.7559 4.1354 2.4401 0.9003 21.5128 0.9985 55.3847 10.7114 2.2145 2.9521 6.3354 3.3048 4.6976 1.0305 3.4248 0.1221 0.9045 0.0726 5.7477 15.3929 9.4417 9.8258 4.5077 5.0545 3.8943 12.2410 12.8559 4.3052 22.1081 0.0964 41.5765 33.6496 45.5383 35.2295 15.4077 8.5331 2.4281 0.7346 2.3736 92.8268 114.0518 28.4897 49.1780 61.7207
temp: 298.150 k
press: 1.00000 atm
elementType: 6 6 6 6 6 6 6 1 1 1 1 1 1 1 1 1 1 1 1 1 1
symmnumber: 1
zpe: 497748.5 jmol-1
zpe.correction: 0.189582 hartree
zpe.thermalcorrener: 0.199192 hartree
zpe.thermalcorrenthalpy: 0.200136 hartree
zpe.thermalcorrgfe: 0.155102 hartree
zpe.sumelectzpe: -274.537898 hartree
zpe.sumelectthermal: -274.528289 hartree
zpe.sumelectthermalent: -274.527345 hartree
zpe.sumelectthermalfe: -274.572379 hartree
dipole: -0.0503 0.0097 -0.0542
dipole: 0.0746
quadrupole: -44.5655 -47.8348 -44.3334
quadrupole: 0.7610 -0.1196 -0.0513
quadrupole: 1.0124 -2.2569 1.2445 0.7610 -0.1196 -0.0513
hfenergy: -274.7274809 hartree
pointgroup: C01 [X(C7H14)]
dipole: -0.0195567 -0.0042043 0.0214647 debye
dipolederiv: 0.0766134 0.0139675 -0.0195427 0.0137331 0.1678141 0.0033386 0.0805069 -0.0019072 0.1258275 0.0763707 -0.0698232 -0.0131424 -0.0583905 -0.2961913 -0.0217841 0.0881312 -0.0393342 0.1251735 -0.0388081 0.0354811 0.0211374 0.0025802 -0.0486724 -0.0333079 -0.0588695 -0.0138492 0.0998628 -0.0491659 -0.048261 0.0224589 0.0055531 -0.0330502 0.0129812 -0.0545418 0.0079723 0.1025627 0.0881863 -0.0474332 0.0056584 -0.1077575 -0.2758492 -0.014579 0.084873 -0.00505 0.1313882 -0.0168164 -0.0130052 -0.0307716 -0.0263719 0.1675634 0.0410268 0.0490775 0.0170169 0.1117508 -0.0169328 -0.049023 0.0148293 0.0040538 0.0193522 0.0154468 -0.063944 0.0240267 0.0915455 0.0246392 -0.0031036 0.0683524 -0.0000136 0.0226645 0.0015041 0.0132921 0.0079793 -0.1868218 0.0295956 0.0161145 -0.0063415 0.0183267 0.1486246 0.0160328 -0.0398395 0.019801 -0.1453942 0.0951987 0.0150651 0.0099847 -0.0042338 0.0680275 0.0414334 0.0465767 -0.0321536 -0.1750309 0.0235344 -0.1379979 0.0418312 -0.1028627 -0.1006434 0.0317504 0.0405672 0.0459385 0.0725387 -0.1915889 0.0817117 -0.0855446 0.0712108 0.0636503 -0.0092271 -0.1001392 0.011578 0.0414163 -0.2104217 -0.0044598 -0.0844969 0.0150373 0.0757742 0.0361262 -0.1017143 0.0197181 0.0439517 0.075685 0.0879048 0.0404828 0.0494373 -0.1409113 -0.0625176 0.03149 -0.075851 0.0624437 0.0890764 -0.0200541 0.00056 -0.007347 0.0731442 -0.0186387 0.0570874 0.0440984 -0.1740813 0.0314656 0.0146392 -0.0307252 0.0328495 0.1473699 0.0271677 -0.0397518 0.0176376 -0.1515784 0.0293154 -0.0262298 0.0636496 -0.0273185 0.0670269 0.0126958 -0.0119486 0.0495184 -0.176063 -0.0613888 0.0772842 0.0207301 0.0994689 -0.1379217 -0.0522664 -0.0059709 -0.0824775 0.069076 0.098478 -0.0175953 0.0027513 -0.0153197 0.0684732 0.0042727 0.0602675 0.0403717 -0.1813739 -0.2274621 0.0092006 -0.0826618 0.0149255 0.0736549 0.030175 -0.1082629 0.0223409 0.05427 0.074426 0.0856174 0.0408006 0.0224389 -0.1299004 -0.0616307 0.033113 -0.0773751 0.0585361 unknown
polarizability: 103.1360337|-1.4057667|65.548322|-4.857703|0.0934702|66.2279855 unknown
InChI: InChI=1S/C7H14/c1-4-5-6-7(2)3/h5-7H,4H2,1-3H3
charge 0 multiplicity 1
21 atoms
C  1.599891 -0.070974 0.283205
C  0.232223 0.148181 -0.34089
C  2.207966 -1.420017 -0.18628
C  2.554645 1.104293 -0.058681
C  -0.93561 0.275452 0.341518
C  -2.300281 0.48585 -0.284167
C  -3.301896 -0.64091 0.080024
H  1.476207 -0.109468 1.384889
H  0.216475 0.205365 -1.443049
H  2.335549 -1.428576 -1.286047
H  1.55403 -2.267742 0.08626
H  3.202238 -1.585081 0.270328
H  3.549954 0.950076 0.399249
H  2.14856 2.065386 0.304485
H  2.695389 1.186758 -1.153737
H  -0.915272 0.21281 1.442605
H  -2.198487 0.555124 -1.384439
H  -2.719238 1.455352 0.057927
H  -3.425288 -0.721112 1.176425
H  -4.297558 -0.44629 -0.359884
H  -2.943896 -1.618175 -0.290841
