program: Gaussian 09
title: 000039149
version: EM64L-G09RevD.01
frameworkgroup: C1[X(C12H18)]
method: RPBEPBE
basis: SDD
operation: Freq
keyword: #p
keyword: freq=noraman
keyword: PBEPBE/SDD
title: #p freq=noraman PBEPBE/SDD
converged: YES YES NO NO
title: Mulliken charges:
elementType: C C C C C C C C C C C C H H H H H H H H H H H H H H H H H H
charge: 0.167893 0.379164 0.379161 -0.584514 -0.566511 -0.566510 -0.430701 -0.430698 -0.252912 -0.688822 -0.680300 -0.680300 0.221455 0.221454 0.213955 0.213975 0.213975 0.213956 0.230339 0.230338 0.221434 0.220923 0.216694 0.220923 0.225567 0.215321 0.216926 0.216926 0.215321 0.225567
chargesum: 0.00000
title: Mulliken charges with hydrogens summed into heavy atoms:
elementType: C C C C C C C C C C C C
charge: 0.167893 0.379164 0.379161 -0.141605 -0.138581 -0.138579 -0.200362 -0.200359 -0.031478 -0.030283 -0.022485 -0.022486
polarizability: 1.51671132e+02 -4.95760018e-05 1.40904513e+02 3.51440006e-05 -4.71789924e+00 8.92736348e+01
1716.lowfreq: -0.0005 -0.0004 0.0005 4.6156 10.4657 11.3449 58.3546 81.2533 94.7971
frequency: 58.2122 81.0835 94.7834 107.0450 140.6727 149.5527 202.5049 207.4510 215.5625 261.5698 293.0227 342.4282 381.9152 382.4781 448.3375 511.4666 521.2984 552.4709 628.6913 629.6500 761.2085 774.2705 775.6961 790.4501 798.5980 811.8912 862.2125 909.7071 962.5888 969.3321 973.3543 987.6052 1032.2051 1046.0838 1051.5760 1060.4371 1064.8764 1108.2817 1109.4945 1175.4548 1188.3500 1230.7086 1243.9548 1244.9735 1257.2186 1281.9977 1310.7241 1312.0064 1317.2695 1375.8090 1386.4712 1386.5143 1388.9259 1453.7874 1453.8927 1468.5233 1469.3401 1471.2104 1471.2505 1478.7052 1483.8110 1489.4431 1494.3151 1517.0113 1593.7443 1601.7127 2977.0458 2977.3730 2977.4005 2993.2686 2993.6566 3009.6957 3039.8887 3041.4263 3050.8130 3073.5131 3073.9430 3074.1630 3080.6174 3082.7722 3083.3427 3108.7764 3116.4774 3148.3391
redmass: 3.0054 2.1578 2.9102 2.6789 3.1870 3.2635 1.1119 1.0303 1.0662 2.6209 3.0972 2.1870 2.1689 4.0811 2.2515 3.5502 4.4596 3.3858 3.2699 3.8772 1.6429 1.8012 1.3129 1.1264 1.9318 2.1872 2.1824 1.3693 2.3314 2.3520 1.3493 2.0016 1.6996 1.4206 2.0467 2.0064 2.1003 1.5970 1.7325 1.1803 2.6427 1.4205 1.6588 1.3033 1.5603 1.2570 1.4343 1.4924 1.6356 4.6767 1.2332 1.2058 1.1997 2.5060 2.3910 1.1258 1.0505 1.0446 1.0420 1.0561 1.0764 1.0821 1.1019 1.0853 7.0062 6.1319 1.0349 1.0349 1.0350 1.0610 1.0610 1.0608 1.1006 1.1000 1.0994 1.1001 1.1000 1.0996 1.1012 1.1008 1.1006 1.0855 1.0914 1.0990
irintensity: 0.1022 0.0021 0.0643 0.0004 1.8140 0.0131 0.0969 0.0747 0.0065 0.0314 0.0131 0.3626 0.0937 7.7047 0.8282 1.2561 2.1582 1.5648 0.0692 0.2130 33.9219 3.1059 1.9574 0.0109 5.4713 24.6806 15.2795 0.2605 5.2991 0.3415 0.7441 1.7289 0.7492 7.0284 2.9283 15.1163 13.7219 2.7312 1.4134 2.2151 1.0960 0.1150 0.5622 0.7188 0.4990 0.7319 0.8559 0.7198 1.0617 0.0857 0.6427 0.8306 35.1912 8.7858 7.9729 6.1799 11.9222 17.7676 0.3593 0.5326 5.6149 17.2067 15.5548 4.8171 7.0014 1.3003 23.6554 67.9230 25.2019 29.3896 40.7668 21.9451 4.0339 16.6751 4.0912 117.1461 6.0031 49.3946 31.6893 90.6207 12.6582 0.3835 33.6499 35.7909
temp: 298.150 k
press: 1.00000 atm
elementType: 6 6 6 6 6 6 6 6 6 6 6 6 1 1 1 1 1 1 1 1 1 1 1 1 1 1 1 1 1 1
symmnumber: 1
zpe: 696882.8 jmol-1
zpe.correction: 0.265429 hartree
zpe.thermalcorrener: 0.278562 hartree
zpe.thermalcorrenthalpy: 0.279506 hartree
zpe.thermalcorrgfe: 0.226356 hartree
zpe.sumelectzpe: -467.157737 hartree
zpe.sumelectthermal: -467.144604 hartree
zpe.sumelectthermalent: -467.143659 hartree
zpe.sumelectthermalfe: -467.196809 hartree
dipole: 0.0000 -0.6790 0.1786
dipole: 0.7021
quadrupole: -69.1036 -71.1841 -78.6056
quadrupole: 0.0000 0.0000 -0.7262
quadrupole: 3.8608 1.7803 -5.6412 0.0000 0.0000 -0.7262
hfenergy: -467.4231652 hartree
pointgroup: C01 [X(C12H18)]
dipole: 0.0000037 -0.26924 -0.061687 debye
polarizability: 151.6711321|0.0001608|141.1531874|0.0011779|3.0589995|89.0249609 unknown
InChI: InChI=1S/C12H18/c1-4-10-8-7-9-11(5-2)12(10)6-3/h7-9H,4-6H2,1-3H3
charge 0 multiplicity 1
30 atoms
C  0.0000 -0.387121 0.094471
C  -1.234916 0.330695 0.170378
C  1.234895 0.330722 0.170427
C  0.000023 -1.91204 -0.005993
C  -2.590627 -0.363552 0.055579
C  2.590625 -0.363499 0.055678
C  -1.216756 1.741508 0.311616
C  1.2167 1.741534 0.311663
C  -0.000037 2.450667 0.381115
C  0.000009 -2.597869 1.388384
C  -3.060658 -0.505545 -1.418402
C  3.060735 -0.505437 -1.418281
H  -0.881733 -2.259085 -0.574029
H  0.881811 -2.259058 -0.573999
H  -2.56989 -1.362799 0.527685
H  -3.345273 0.225933 0.610437
H  3.34523 0.225981 0.610598
H  2.569877 -1.362762 0.52775
H  -2.169416 2.282992 0.37196
H  2.169347 2.283039 0.372041
H  -0.000052 3.540451 0.496991
H  0.890099 -2.304943 1.974412
H  0.000028 -3.699319 1.289315
H  -0.890114 -2.304971 1.974377
H  -3.139326 0.486286 -1.898775
H  -4.049709 -0.997048 -1.473969
H  -2.344991 -1.104931 -2.01043
H  2.345114 -1.104823 -2.010364
H  4.0498 -0.996916 -1.473813
H  3.139406 0.48641 -1.898621
