program: Gaussian 09
title: 000039165
version: EM64L-G09RevD.01
frameworkgroup: C1[X(C16H15N3O)]
method: RPBEPBE
basis: SDD
operation: Freq
keyword: #p
keyword: freq=noraman
keyword: PBEPBE/SDD
title: #p freq=noraman PBEPBE/SDD
converged: YES YES NO NO
title: Mulliken charges:
elementType: O N N N C C C C C C C C C C C C C C C C H H H H H H H H H H H H H H H
charge: -0.236667 -0.149355 -0.134901 -0.112209 0.414023 0.313420 0.164746 -0.472991 0.165912 -0.333511 -0.316850 0.157699 -0.320784 -0.370616 -0.338280 -0.366570 -0.315298 -0.645074 -0.646061 -0.160761 0.289793 0.239258 0.237375 0.251601 0.263109 0.251491 0.244274 0.271120 0.239307 0.238942 0.219066 0.239342 0.219043 0.239718 0.260693
chargesum: 0.00000
title: Mulliken charges with hydrogens summed into heavy atoms:
elementType: O N N N C C C C C C C C C C C C C C C C
charge: -0.236667 -0.149355 -0.134901 -0.112209 0.414023 0.313420 0.164746 -0.183198 0.165912 -0.094253 -0.079475 0.157699 -0.069183 -0.107507 -0.086789 -0.122297 -0.044179 0.052240 0.052042 0.099932
polarizability: 5.55241267e+02 1.16426849e+00 1.91527176e+02 1.16496496e-02 8.71086908e-02 8.58383112e+01
1716.lowfreq: -3.3195 -2.9851 -0.0007 -0.0005 0.0008 8.9567 23.1422 34.6952 48.0975
frequency: 23.1309 34.6721 48.0915 77.0046 78.4813 117.4083 143.9838 153.6124 190.6513 199.4526 206.7951 242.5599 260.0104 273.8835 355.6534 377.4726 395.4249 403.2463 432.0054 443.4718 464.9497 492.6374 526.6299 527.8778 566.3644 571.3313 619.9083 636.9971 644.3954 714.6617 738.4283 746.0492 759.3916 770.6510 790.0274 805.4844 824.8514 833.1438 854.2796 863.2614 881.7693 927.4225 939.3372 951.5633 958.2040 961.4440 981.6603 985.5638 987.8349 1057.3492 1081.0208 1105.7110 1105.8248 1111.8581 1119.5664 1126.5492 1154.9687 1162.6488 1168.9315 1223.2584 1248.3023 1256.1156 1267.8477 1306.2113 1306.9565 1342.1453 1362.4966 1379.5813 1401.9996 1430.1558 1432.3593 1454.4243 1457.8851 1459.4323 1466.0014 1477.9104 1491.6239 1499.7627 1519.9721 1523.6888 1553.0562 1593.9101 1612.6863 1624.9294 2947.5971 2954.6758 3015.7256 3018.9472 3100.0271 3110.2036 3145.2594 3148.5778 3157.2113 3168.3737 3169.2445 3173.2587 3180.7197 3223.2181 3264.2387
redmass: 4.1037 4.7114 5.4376 3.0699 3.4370 1.6518 5.5900 2.5472 2.3048 1.6529 4.5817 4.3033 3.1811 4.2207 5.4693 4.4966 4.1990 4.4213 3.2099 3.7257 3.8260 4.3783 5.4503 2.3786 3.7464 5.2397 6.6437 6.7505 3.2201 5.4615 2.5043 2.7412 5.9901 1.9188 6.0401 1.2610 1.4950 1.7269 7.1594 1.3254 6.1691 1.5157 3.0519 2.8134 1.3422 1.3618 1.3367 3.4988 2.8550 1.5006 2.1905 1.5921 1.2883 1.3261 1.3764 1.5050 1.6908 1.6501 1.6107 1.9762 1.8381 2.9361 2.6052 2.1147 1.5034 7.1681 3.2273 5.0852 7.2463 2.7100 1.2245 3.0649 3.8639 1.3954 1.0394 1.0453 1.1267 1.3440 1.9510 4.7545 6.4735 7.9288 8.1219 6.2503 1.0367 1.0391 1.0998 1.1027 1.0966 1.0946 1.0880 1.0866 1.0884 1.0954 1.0920 1.0955 1.0974 1.0923 1.1074
irintensity: 1.3899 0.6613 1.9128 0.1452 0.2620 3.9267 0.2206 0.0132 0.3243 0.0791 0.6708 9.3983 1.9494 0.0411 5.8224 6.5187 2.4407 1.6813 0.7088 2.1838 10.1859 40.1310 19.7249 18.6580 0.2955 1.1425 4.1836 1.2698 7.1812 0.0959 21.1595 37.3583 4.2648 27.5320 13.0775 2.0527 2.5539 108.1425 3.7531 1.6584 0.2761 36.3426 39.2852 1.6580 0.0506 2.4554 1.3675 13.7684 0.0923 26.5032 29.9512 12.5838 2.4312 1.0928 34.2414 36.8163 183.2471 3.0684 69.9190 4.7742 18.0199 26.2280 37.1484 37.3652 16.8056 313.4728 213.9100 12.6263 11.8200 30.9461 6.3739 16.8277 18.3352 19.0058 0.0056 23.3357 0.7213 11.0327 225.4990 22.1845 49.6490 2.7332 1.4149 596.4863 92.6522 198.5063 8.5888 70.8854 4.3723 49.4139 5.9574 5.5637 1.2996 19.2557 0.6112 24.5269 10.9296 3.8527 1.4109
temp: 298.150 k
press: 1.00000 atm
elementType: 8 7 7 7 6 6 6 6 6 6 6 6 6 6 6 6 6 6 6 6 1 1 1 1 1 1 1 1 1 1 1 1 1 1 1
symmnumber: 1
zpe: 720436.3 jmol-1
zpe.correction: 0.274400 hartree
zpe.thermalcorrener: 0.291742 hartree
zpe.thermalcorrenthalpy: 0.292686 hartree
zpe.thermalcorrgfe: 0.227748 hartree
zpe.sumelectzpe: -856.715056 hartree
zpe.sumelectthermal: -856.697714 hartree
zpe.sumelectthermalent: -856.696769 hartree
zpe.sumelectthermalfe: -856.761708 hartree
dipole: -5.7950 -0.9939 0.0061
dipole: 5.8797
quadrupole: -69.3650 -102.3541 -123.5864
quadrupole: -6.7072 -0.0374 0.0040
quadrupole: 29.0702 -3.9189 -25.1513 -6.7072 -0.0374 0.0040
hfenergy: -856.9894557 hartree
pointgroup: C01 [X(C16H15N3O1)]
dipole: 2.2689425 0.4475888 -0.0513265 debye
polarizability: 554.7907104|10.1569468|191.7259735|-8.854368|-3.1825666|86.0900705 unknown
InChI: InChI=1S/C16H15N3O/c1-19(2)15-6-3-13(4-7-15)17-18-14-5-8-16-12(11-14)9-10-20-16/h3-11H,1-2H3
charge 0 multiplicity 1
35 atoms
O  -6.093122 -0.412987 0.115273
N  5.846041 0.199169 -0.120867
N  -0.495536 -0.76387 0.0202
N  0.169306 0.369649 -0.024092
C  4.451974 0.215602 -0.097191
C  -4.011187 0.624008 0.046961
C  -4.699053 -0.628491 0.095371
C  -2.600768 0.635896 0.019958
C  -1.920627 -0.611695 0.042627
C  3.72249 1.450404 -0.119607
C  3.697538 -1.008484 -0.049086
C  1.581365 0.237447 -0.046424
C  -4.053843 -1.874239 0.118517
C  -5.046676 1.650478 0.037163
C  -2.645978 -1.845167 0.091231
C  2.321306 1.450825 -0.094518
C  2.300085 -0.995697 -0.024371
C  6.597316 1.461757 -0.161516
C  6.573876 -1.078089 -0.102335
C  -6.258939 0.997653 0.078434
H  -2.016065 1.559183 -0.017411
H  4.252631 2.405531 -0.157604
H  4.217679 -1.970426 -0.029949
H  -4.61503 -2.811428 0.155732
H  -4.899963 2.728203 0.003927
H  -2.06337 -2.771524 0.106654
H  1.762171 2.39263 -0.111669
H  1.72945 -1.929059 0.01282
H  6.378037 2.096646 0.720286
H  6.364185 2.048914 -1.072572
H  7.676995 1.246134 -0.164099
H  6.360345 -1.659845 0.816778
H  7.656835 -0.882005 -0.134876
H  6.315853 -1.709817 -0.975704
H  -7.291921 1.335394 0.088259
