program: Gaussian 09
title: 000005632
version: EM64L-G09RevD.01
frameworkgroup: C1[X(C18H18F3NO2)]
method: RPBEPBE
basis: SDD
operation: Freq
keyword: #p
keyword: freq=noraman
keyword: PBEPBE/SDD
title: #p freq=noraman PBEPBE/SDD
converged: YES YES NO NO
title: Mulliken charges:
elementType: F F F O O N C C C C C C C C C C C C C C C C C C H H H H H H H H H H H H H H H H H H
charge: -0.165439 -0.168370 -0.168693 -0.280084 -0.324183 -0.516849 -0.370736 -0.344060 -0.256220 0.324272 0.017678 0.476290 -0.500276 0.227914 0.319389 -0.686656 -0.371225 -0.311346 -0.437824 -0.386878 -0.221596 -0.257713 -0.181847 0.242433 0.210287 0.208349 0.197001 0.198187 0.226156 0.225652 0.370796 0.298413 0.212170 0.212769 0.219962 0.269676 0.271266 0.251553 0.265776 0.232992 0.236199 0.234816
chargesum: 0.00000
title: Mulliken charges with hydrogens summed into heavy atoms:
elementType: F F F O O N C C C C C C C C C C C C C C C C C C
charge: -0.165439 -0.168370 -0.168693 -0.280084 -0.324183 -0.146053 0.047900 0.051128 0.195587 0.324272 0.017678 0.476290 -0.201863 0.227914 0.319389 -0.041755 -0.101549 -0.040080 -0.186270 -0.121102 0.011396 -0.022897 0.054351 0.242433
polarizability: 3.39321184e+02 2.88319579e+01 2.44929650e+02 6.07169439e+00 1.35773727e+01 1.22113067e+02
1716.lowfreq: -7.1729 -0.0006 0.0005 0.0009 3.3075 3.7464 9.4121 12.3517 27.5593
frequency: -5.2062 12.1806 27.5524 37.9467 47.8271 61.3667 69.5214 88.8225 112.0667 116.4605 133.3555 136.9543 158.3143 190.3859 193.0798 219.0832 238.0489 251.8988 261.2024 304.0472 314.7210 334.9962 349.7750 387.8193 409.3514 426.5266 430.1988 438.9056 480.8977 510.1148 521.1827 524.1243 578.7386 604.0471 613.7442 647.7140 662.8433 678.3610 694.6456 703.8172 741.3610 749.1192 773.8104 794.3961 797.5342 802.0519 823.6600 839.6065 866.1165 892.5465 905.3668 912.6275 917.8422 920.2902 933.7194 972.0504 979.7147 981.3707 984.3402 992.7727 1011.8597 1037.7226 1044.7863 1053.5400 1064.3352 1082.4868 1107.0541 1124.5546 1137.3951 1146.1614 1178.7057 1186.9571 1210.6233 1211.9096 1238.4069 1265.4746 1272.0039 1279.1932 1284.0551 1291.2816 1314.5952 1336.8804 1348.0396 1371.7035 1386.3471 1391.9031 1398.5950 1437.1909 1442.1088 1460.1377 1468.8512 1472.6116 1475.7441 1479.6461 1482.0025 1490.4820 1520.5755 1566.8808 1590.7056 1607.9825 1625.6500 1638.7915 2970.6144 2977.0167 2992.2023 3003.5311 3014.3591 3046.0230 3071.1857 3077.9843 3080.3244 3136.0302 3136.6044 3157.5992 3157.9422 3173.0964 3178.9483 3180.7994 3184.0119 3223.5154
redmass: 16.1595 4.7430 4.0639 4.4340 5.9821 2.0210 4.2323 4.8588 2.3319 5.0812 5.2306 4.4374 3.9749 4.6175 4.7662 1.2367 5.1161 5.3330 4.9849 7.3771 7.0868 8.3578 5.7449 6.4980 5.7724 3.6886 4.6941 3.9537 5.0089 8.4007 3.8133 6.0377 6.7872 8.6068 7.3522 6.2591 6.3225 4.2665 2.8449 4.5770 1.0717 2.6677 1.5504 2.3930 1.1533 2.8433 2.2292 1.9095 1.4896 3.6342 1.8894 2.0082 1.3983 3.5465 1.1705 1.4033 3.9798 2.4646 2.5938 1.3506 5.8808 3.6310 2.5417 3.8962 3.3870 2.2353 1.7325 2.6229 1.8958 1.4682 1.0780 1.0878 2.1747 1.3472 2.4997 1.6561 1.1665 1.6512 2.0465 1.0784 1.4966 2.1237 1.4745 1.9749 3.0696 1.3313 7.2950 2.8609 3.3091 2.8227 1.0826 1.0631 1.0426 1.0856 2.4178 1.0948 4.1749 6.5558 5.5585 4.1860 5.9001 2.3885 1.0588 1.0367 1.0599 1.0566 1.1005 1.1037 1.1033 1.0994 1.1059 1.0872 1.0882 1.0931 1.0906 1.0932 1.0946 1.0972 1.0965 1.0804
irintensity: 0.0999 0.1218 0.5184 0.0478 0.9896 0.8613 1.5828 0.3216 0.1424 0.0159 0.2203 1.7579 1.8161 1.5825 2.0368 0.4307 0.3605 10.3924 3.6377 5.3742 2.3295 6.2340 1.6436 4.7562 8.2910 13.5696 6.4483 0.3632 8.5024 4.2391 16.4693 1.9405 3.3017 24.1223 6.3178 18.1095 0.2721 23.6631 12.5077 17.5671 9.6174 32.4267 48.4232 21.7289 0.1623 18.6558 95.6215 73.3370 17.4757 4.2445 29.2926 3.0334 32.2037 28.1869 0.5497 5.2751 157.9450 58.1482 7.9151 0.8363 134.0697 7.9206 55.7710 373.7646 37.3431 5.4565 3.4394 1.3577 115.8074 2.6229 7.1170 2.2021 48.4768 0.0986 704.9946 38.1888 1.1275 42.3987 243.5192 0.2107 40.7812 153.2448 21.5423 8.4206 24.4477 3.3942 15.8819 62.3845 18.1728 162.1607 1.8313 0.8910 13.1844 5.6416 0.3968 21.0947 468.3847 80.4666 24.6396 484.7930 10.5613 108.0801 26.2016 33.8223 17.1514 36.5649 6.7885 2.3996 7.3307 49.0775 114.4621 5.9963 8.1159 12.8829 9.2827 9.2853 0.7737 9.3488 5.6017 315.1778
temp: 298.150 k
press: 1.00000 atm
elementType: 9 9 9 8 8 7 6 6 6 6 6 6 6 6 6 6 6 6 6 6 6 6 6 6 1 1 1 1 1 1 1 1 1 1 1 1 1 1 1 1 1 1
symmnumber: 1
zpe: 848455.3 jmol-1
zpe.correction: 0.323160 hartree
zpe.thermalcorrener: 0.345126 hartree
zpe.thermalcorrenthalpy: 0.346070 hartree
zpe.thermalcorrgfe: 0.269336 hartree
zpe.sumelectzpe: -1199.726339 hartree
zpe.sumelectthermal: -1199.704372 hartree
zpe.sumelectthermalent: -1199.703428 hartree
zpe.sumelectthermalfe: -1199.780162 hartree
dipole: 5.0700 -0.9508 -1.4760
dipole: 5.3654
quadrupole: -140.3653 -127.6846 -143.6143
quadrupole: 5.5845 9.6522 2.1442
quadrupole: -3.1439 9.5368 -6.3929 5.5845 9.6522 2.1442
hfenergy: -1200.0494981 hartree
pointgroup: C01 [X(C18H18F3N1O2)]
dipole: -1.9757272 0.4287642 -0.6071645 debye
polarizability: 341.3471855|25.3336844|242.1759567|-5.6436435|-16.4582144|122.8407593 unknown
InChI: InChI=1S/C18H18F3NO2/c1-2-3-11-24-17(23)15-9-4-5-10-16(15)22-14-8-6-7-13(12-14)18(19,20)21/h4-10,12,22H,2-3,11H2,1H3
charge 0 multiplicity 1
42 atoms
F  6.216445 0.592278 1.268379
F  4.631155 -0.865365 1.991255
F  5.677439 -1.216012 0.015906
O  -3.791691 -0.089339 -0.000441
O  -2.069395 1.398081 -0.454422
N  0.384126 0.411178 -0.653914
C  -6.113996 0.533147 0.359704
C  -7.154496 1.67078 0.495787
C  -4.71578 1.083007 0.080872
C  -0.173285 -0.866883 -0.556318
C  -1.600977 -0.999945 -0.360049
C  1.73545 0.811612 -0.603673
C  2.743526 0.102688 0.102707
C  -2.461996 0.196833 -0.280907
C  4.062138 0.6072 0.136758
C  -8.577276 1.136245 0.765296
C  0.598659 -2.059869 -0.699019
C  -2.180081 -2.296638 -0.266558
C  2.081956 2.042048 -1.235765
C  4.40922 1.819228 -0.501596
C  -0.004163 -3.324482 -0.608876
C  -1.397864 -3.456167 -0.375765
C  3.397258 2.537989 -1.175942
C  5.119665 -0.192409 0.842168
H  -6.092001 -0.06752 1.289313
H  -6.410108 -0.149301 -0.460067
H  -7.158624 2.281795 -0.429745
H  -6.852694 2.350567 1.318201
H  -4.663573 1.636781 -0.874693
H  -4.359103 1.751413 0.886347
H  -0.333434 1.1609 -0.713347
H  2.497339 -0.798922 0.668343
H  -8.915169 0.47593 -0.055178
H  -8.610773 0.550934 1.703132
H  -9.305495 1.962381 0.856154
H  1.664993 -1.991712 -0.925399
H  -3.260311 -2.363899 -0.112554
H  1.307336 2.598982 -1.77508
H  5.434882 2.195103 -0.459278
H  0.616741 -4.218814 -0.73334
H  3.640119 3.485761 -1.666951
H  -1.857862 -4.445881 -0.299344
