program: Gaussian 09
title: 000005564
version: EM64L-G09RevD.01
frameworkgroup: C1[X(C12H7Cl3O2)]
method: RPBEPBE
basis: SDD
operation: Freq
keyword: #p
keyword: freq=noraman
keyword: PBEPBE/SDD
title: #p freq=noraman PBEPBE/SDD
converged: YES YES NO NO
title: Mulliken charges:
elementType: Cl Cl Cl O O C C C C C C C C C C C C H H H H H H H
charge: -0.015007 -0.048658 -0.052199 -0.274272 -0.414367 0.206310 0.518559 0.215030 -0.318638 -0.304963 -0.297263 -0.333738 -0.225216 -0.197561 -0.221608 -0.082035 -0.109033 0.268426 0.261021 0.254031 0.262317 0.280920 0.257614 0.370328
chargesum: 0.00000
title: Mulliken charges with hydrogens summed into heavy atoms:
elementType: Cl Cl Cl O O C C C C C C C C C C C C
charge: -0.015007 -0.048658 -0.052199 -0.274272 -0.044039 0.206310 0.518559 0.215030 -0.050212 -0.304963 -0.036242 -0.079707 0.037101 0.083359 0.036007 -0.082035 -0.109033
polarizability: 2.56662744e+02 9.84425213e-01 1.46287293e+02 1.26804320e+01 -6.98463457e+00 1.05046776e+02
1716.lowfreq: -6.6489 -3.8509 -0.0033 -0.0026 -0.0022 3.2052 24.3920 27.7073 41.1036
frequency: 24.3659 27.6706 41.0844 104.4887 116.2602 147.0926 164.9739 199.2481 205.0518 225.0924 265.5905 294.4238 324.7049 336.8086 366.9322 370.2555 394.6372 438.4510 441.6234 455.8163 505.7050 543.4146 554.4090 571.0702 630.5085 646.2897 679.6969 691.1169 716.8297 755.8439 805.3116 809.4172 824.3617 832.0582 861.0237 879.8207 935.0686 936.3909 1027.3900 1064.4069 1080.4871 1081.8762 1137.5354 1142.2557 1175.9665 1226.3232 1245.4554 1259.6284 1276.8873 1362.2889 1384.4257 1386.9840 1394.0292 1454.9926 1487.2926 1576.8285 1584.7649 1596.4174 1608.7588 3145.9805 3155.3911 3167.1382 3178.5235 3183.9247 3188.4070 3586.3038
redmass: 9.7381 8.5044 8.5627 8.2539 9.3464 19.0691 5.9250 7.6499 9.7608 9.0520 7.8268 4.2401 1.5097 4.3358 12.4488 7.2870 7.7405 3.3248 4.0130 4.4007 5.7384 4.4679 7.7337 5.0668 6.2597 6.9500 6.7068 4.0570 4.1728 6.4069 1.3995 1.5157 1.4731 6.3013 1.3908 7.5911 1.3440 1.3355 4.2048 2.1961 2.3887 2.0569 1.2068 1.3067 2.7488 2.8343 1.3623 1.9034 1.8438 4.9830 6.1551 7.1249 4.1822 2.6792 2.9853 7.9466 7.2821 7.5532 8.0061 1.0927 1.0887 1.0894 1.0965 1.0936 1.0973 1.0665
irintensity: 0.4544 0.0681 0.0260 0.8530 0.1525 0.1282 0.3403 0.3730 0.6796 4.6487 0.3313 18.5396 90.6378 16.7940 11.2785 8.0100 1.6056 6.5000 7.9920 14.6787 8.2840 9.8308 5.3393 11.6879 11.3554 10.2184 13.1315 4.8090 15.7710 42.8371 46.5648 21.3664 53.0813 43.0239 21.5099 48.6373 0.1089 0.5225 75.7967 50.6547 82.2814 43.1032 37.6178 1.3726 70.1602 279.0446 14.1483 173.6476 10.0456 13.8985 2.4378 9.0445 29.1955 312.9239 207.9199 33.0486 2.5391 6.5777 38.3070 1.9825 3.6673 1.7783 0.9620 0.6825 0.3149 51.1759
temp: 298.150 k
press: 1.00000 atm
elementType: 17 17 17 8 8 6 6 6 6 6 6 6 6 6 6 6 6 1 1 1 1 1 1 1
symmnumber: 1
zpe: 408426.5 jmol-1
zpe.correction: 0.155561 hartree
zpe.thermalcorrener: 0.171102 hartree
zpe.thermalcorrenthalpy: 0.172046 hartree
zpe.thermalcorrgfe: 0.110239 hartree
zpe.sumelectzpe: -1990.884378 hartree
zpe.sumelectthermal: -1990.868837 hartree
zpe.sumelectthermalent: -1990.867893 hartree
zpe.sumelectthermalfe: -1990.929700 hartree
dipole: -2.1253 -1.8701 0.7126
dipole: 2.9193
quadrupole: -129.8138 -120.3964 -108.2569
quadrupole: 1.8932 -1.5584 -5.0033
quadrupole: -10.3247 -0.9074 11.2321 1.8932 -1.5584 -5.0033
hfenergy: -1991.0399392 hartree
pointgroup: C01 [X(C12H7Cl3O2)]
dipole: 0.8334401 -0.6473081 -0.4533009 debye
dipolederiv: -0.0885121 -0.0025931 -0.0114053 -0.0146724 -0.7006959 -0.1601784 -0.0086738 -0.1541753 -0.072458 -0.8096081 0.2409043 0.0075357 0.3000972 -0.1590129 -0.0059344 0.0741255 -0.0239564 -0.1280735 -0.7397137 -0.2404617 -0.1980586 -0.2670709 -0.2370549 -0.0957666 -0.2279784 -0.0983749 -0.1334198 -2.2274581 0.0279033 -0.2604026 0.1383183 -0.2699291 -0.0385937 -0.5390582 -0.037475 -0.2921473 -0.4443022 0.0614508 -0.5013738 -0.0237923 -0.3665931 0.2165073 -0.4777272 0.244495 -0.9520899 1.4442386 -0.2218902 0.1173732 -0.7583295 0.096269 -0.0786744 -0.2622501 0.0685054 -0.0777092 1.5947634 0.1845128 0.2410843 0.6571449 -0.1201185 0.0154801 0.6626199 -0.0561114 0.2084742 0.2151139 -0.1438667 0.4357131 0.0315428 0.1106648 -0.1756013 0.5320678 -0.2415228 0.9076592 -0.0274952 -0.0868518 0.0048203 -0.0784099 -0.0670474 0.0156175 0.0516621 -0.0054705 0.0714697 -0.1505527 -0.0531632 0.0031997 -0.0200748 1.0676723 0.2759612 0.0036409 0.2610955 -0.0239872 -0.2023195 0.0851822 0.0206906 -0.2803294 0.0059344 -0.004952 -0.1281988 0.0639918 -0.1399365 -0.3605081 0.0867432 -0.2413022 0.0859923 -0.1831963 0.0958068 0.0562396 0.007517 -0.1303492 -0.4287268 0.0790776 0.0373954 0.0923862 -0.1709624 -0.0161778 0.1656844 -0.0424224 -0.0931668 -0.2035863 -0.0859721 -0.0527557 -0.0824879 -0.2504364 -0.0730121 -0.0587706 -0.0653003 -0.0833776 -0.1709885 -0.1539273 -0.0440674 -0.0447062 -0.0179 0.0051529 -0.0179919 -0.0180179 -0.1078116 1.1132399 -0.4174414 0.0164433 -0.4690775 0.1175249 0.0087523 -0.2506768 0.0682865 0.2682063 0.9608781 0.3774877 0.3231809 0.3762676 0.2367025 0.1650961 0.3421592 0.1686226 0.0297512 0.092489 0.042981 0.0613279 0.0460171 0.1401896 -0.0245687 0.0686638 -0.0196075 0.0207883 0.0187064 0.0628263 -0.0285917 0.1180758 0.0444388 -0.0096821 -0.0339067 -0.0179582 0.1258371 0.0758503 0.0307185 0.0167988 0.035684 0.1658703 -0.0151607 0.0374017 -0.0117556 -0.03955 0.0508801 0.0385016 -0.0627395 0.0500323 0.1598477 0.0170754 -0.0573142 0.0156544 0.0208994 0.0434653 0.0469873 -0.0168193 0.042945 0.0786866 -0.0094127 -0.0218594 -0.0115625 0.1609402 0.0858876 -0.0079402 -0.016422 -0.0210834 -0.022536 -0.0421854 -0.0222013 -0.0455193 0.15138 0.1582584 0.0488308 0.148375 0.0855305 0.341682 -0.0655495 0.1123426 -0.0489382 0.3086712 unknown
polarizability: 250.9954645|-17.3139489|137.5932669|26.3710267|16.6181918|119.4080815 unknown
InChI: InChI=1S/C12H7Cl3O2/c13-7-1-3-11(9(15)5-7)17-12-4-2-8(14)6-10(12)16/h1-6,16H
charge 0 multiplicity 1
24 atoms
Cl -2.25076 2.980144 0.521984
Cl 5.521304 -1.300698 0.166486
Cl -5.226208 -1.390404 -1.184897
O  -0.017123 1.029149 0.667382
O  1.008297 0.459801 -1.873287
C  1.235705 0.390242 0.519335
C  -1.188957 0.413414 0.19135
C  1.799062 0.148925 -0.765116
C  1.988357 0.134421 1.680063
C  -2.346886 1.222374 0.100675
C  -1.278425 -0.958869 -0.134518
C  3.108174 -0.376775 -0.86642
C  3.301842 -0.381107 1.591878
C  -3.578885 0.683998 -0.31484
C  -2.504103 -1.516067 -0.555964
C  3.833292 -0.63115 0.313673
C  -3.636559 -0.684924 -0.640944
H  1.536136 0.352815 2.651614
H  -0.389539 -1.591949 -0.05628
H  3.558038 -0.570815 -1.84643
H  3.888312 -0.579672 2.491845
H  -4.464183 1.320709 -0.382512
H  -2.572047 -2.577347 -0.809282
H  1.490256 0.300284 -2.722195
