program: Gaussian 09
title: 000039148
version: EM64L-G09RevD.01
frameworkgroup: C1[X(C12H18N6O3)]
method: RPBEPBE
basis: SDD
operation: Freq
keyword: #p
keyword: freq=noraman
keyword: PBEPBE/SDD
title: #p freq=noraman PBEPBE/SDD
converged: YES YES NO NO
title: Mulliken charges:
elementType: O O O N N N N N N C C C C C C C C C C C C H H H H H H H H H H H H H H H H H H
charge: -0.242062 -0.442491 -0.430346 -0.131171 -0.181411 -0.087991 -0.147121 -0.064107 -0.606589 -0.097418 -0.197124 -0.150346 -0.140302 -0.333726 -0.631167 -0.622287 0.212906 -0.183954 -0.103309 0.167832 -0.345053 0.253879 0.235772 0.241641 0.275985 0.230440 0.227831 0.382915 0.229794 0.201370 0.219745 0.275530 0.198049 0.210047 0.305800 0.335415 0.248715 0.348799 0.335510
chargesum: 0.00000
title: Mulliken charges with hydrogens summed into heavy atoms:
elementType: O O O N N N N N N C C C C C C C C C C C C
charge: -0.242062 -0.059577 -0.094931 -0.131171 -0.181411 -0.087991 -0.147121 -0.064107 0.077720 0.156461 0.038649 0.091295 0.135683 0.124544 0.019743 0.061340 0.212906 0.121846 -0.103309 0.167832 -0.096338
polarizability: 2.38591038e+02 2.80257893e+00 1.86485452e+02 1.94202647e+01 -1.34865617e+00 1.16101849e+02
1716.lowfreq: -5.5596 -2.4927 -0.0004 0.0003 0.0005 5.0159 26.2965 39.2888 51.5114
frequency: 26.1610 39.2616 51.4917 73.5186 86.3277 101.4523 133.3893 148.7588 161.3718 188.7908 199.0121 212.5774 234.6846 248.4704 257.3463 268.8005 279.7493 292.3186 306.3036 323.6157 344.1684 381.5736 397.9836 458.2374 504.4881 510.0287 515.7859 529.3044 553.2609 554.5649 567.7783 611.3473 630.0779 641.5144 665.1812 694.5863 710.2637 767.0884 788.5638 804.0343 805.3367 850.8217 852.6536 864.3880 914.0621 928.5693 959.7550 970.3748 992.4471 1007.5406 1023.6975 1029.4133 1039.6681 1053.7240 1056.3171 1081.8636 1086.6547 1107.7022 1138.6454 1143.6319 1164.4364 1181.7832 1198.9018 1217.6457 1230.5982 1243.2593 1261.1590 1272.4735 1277.5928 1287.7758 1291.0801 1305.8501 1323.8240 1335.1667 1351.5858 1357.1502 1366.7482 1371.2475 1377.4370 1383.5515 1426.9483 1429.8128 1449.1160 1455.2371 1455.9220 1460.7024 1472.0854 1473.4526 1474.5315 1487.3582 1537.6295 1580.2358 1635.5819 2859.7046 2870.5005 2897.3547 2967.8284 2997.1536 3017.2041 3025.5009 3031.2764 3039.6061 3081.7025 3099.9078 3102.1447 3121.4247 3170.2542 3249.4477 3537.4746 3555.4272 3692.0977
redmass: 5.6907 5.2213 4.2870 3.2589 5.3816 3.3747 3.0880 2.9012 6.0090 3.9116 1.3524 2.6595 1.3220 4.0806 4.1819 1.3280 3.8098 5.4273 6.1660 3.1961 4.2206 3.4000 4.5862 3.1900 3.3266 3.2181 8.2686 1.2559 1.2260 2.4514 3.9312 6.7705 6.9046 4.9968 9.1780 4.5353 6.3742 5.1595 3.1290 2.5998 1.5935 1.5899 3.8706 7.2635 2.4563 1.4272 2.5914 3.4097 3.7561 4.4544 3.4329 3.2199 1.6943 3.2038 4.5809 2.0448 1.4240 2.5864 1.6262 3.7118 1.4058 1.8437 2.1368 2.6627 1.5567 1.4202 1.7736 2.8373 1.8573 1.8522 2.1582 1.2224 3.4609 1.3730 1.3134 1.2972 1.3656 2.0160 4.8825 1.2430 1.1384 3.0052 1.1445 1.2148 1.1298 1.1402 3.8923 1.0567 1.0696 1.0578 8.7495 1.8250 2.8216 1.0784 1.0574 1.0545 1.0836 1.0672 1.0858 1.0761 1.0851 1.0799 1.1005 1.0679 1.0959 1.0981 1.0924 1.0999 1.0444 1.0662 1.1056
irintensity: 2.3725 0.5300 2.6495 1.2501 1.1304 6.2313 4.4001 1.9653 6.6965 3.6583 1.2552 9.5774 5.0973 16.9046 8.8683 117.0227 11.3865 1.8949 7.0331 5.2131 0.4328 12.7652 5.5150 13.5249 7.8841 3.1834 8.3349 247.2818 0.3567 10.0341 6.8634 6.4171 3.8892 49.6342 10.4514 8.1838 27.0400 5.1778 3.8986 54.2169 77.6340 24.5943 42.4212 1.6149 5.7313 9.4631 14.1233 71.8561 33.9040 72.9644 83.2977 6.8962 13.2451 35.1103 61.2663 12.7586 1.7915 26.7983 5.8602 28.8876 10.9103 84.9314 19.2827 46.4459 28.8166 2.9280 17.4303 47.1609 79.6466 8.6791 29.2972 12.8210 29.1148 13.8694 8.3287 47.9393 17.4325 55.0663 15.4451 3.1745 1.5422 50.5062 27.3932 51.9115 30.8686 26.4640 24.9521 3.2683 22.4905 12.1107 44.5943 31.2684 647.8498 40.1092 104.8101 133.7496 30.5059 42.6382 18.4758 29.9506 49.0535 49.6382 36.0563 662.4364 17.5935 15.1288 13.0179 12.2200 139.3052 5.8607 52.1220
temp: 298.150 k
press: 1.00000 atm
elementType: 8 8 8 7 7 7 7 7 7 6 6 6 6 6 6 6 6 6 6 6 6 1 1 1 1 1 1 1 1 1 1 1 1 1 1 1 1 1 1
symmnumber: 1
zpe: 817195.3 jmol-1
zpe.correction: 0.311253 hartree
zpe.thermalcorrener: 0.330997 hartree
zpe.thermalcorrenthalpy: 0.331941 hartree
zpe.thermalcorrgfe: 0.262946 hartree
zpe.sumelectzpe: -1020.635089 hartree
zpe.sumelectthermal: -1020.615345 hartree
zpe.sumelectthermalent: -1020.614401 hartree
zpe.sumelectthermalfe: -1020.683396 hartree
dipole: 1.8120 0.6027 -0.4019
dipole: 1.9514
quadrupole: -94.6070 -132.3560 -127.6365
quadrupole: 0.8437 4.5543 3.9930
quadrupole: 23.5929 -14.1562 -9.4366 0.8437 4.5543 3.9930
hfenergy: -1020.9463424 hartree
pointgroup: C01 [X(C12H18N6O3)]
dipole: 0.7140326 -0.1861719 0.2119771 debye
polarizability: 236.1570555|-13.7428078|175.7251329|-21.8732017|-25.0420787|129.2961513 unknown
InChI: InChI=1S/C12H18N6O3/c1-17(2)8-6(3-19)21-12(9(8)20)18-5-16-7-10(13)14-4-15-11(7)18/h4-6,8-9,12,19-20H,3,13H2,1-2H3
charge 0 multiplicity 1
39 atoms
O  1.50073 -1.840599 -0.830034
O  1.128066 1.664199 -1.617226
O  2.17808 -2.812659 1.808406
N  3.755943 0.959957 0.192128
N  -0.637147 -0.845018 -0.316398
N  -2.360928 -1.678568 0.943322
N  -1.611596 1.348029 -0.959752
N  -3.872463 1.644954 -0.052628
N  -4.951473 0.024666 1.285259
C  2.864215 0.133766 -0.65091
C  1.387378 0.596835 -0.672892
C  2.7198 -1.332638 -0.128774
C  0.628814 -0.707723 -1.076641
C  2.563933 -1.455172 1.401058
C  5.155032 0.472185 0.146062
C  3.704811 2.409289 -0.13204
C  -1.637826 0.123018 -0.34265
C  -1.117006 -1.906105 0.469784
C  -2.699282 -0.410296 0.43381
C  -3.856748 0.412268 0.565524
C  -2.776903 2.040325 -0.76226
H  3.206279 0.089762 -1.717148
H  1.086333 0.891469 0.355608
H  3.530003 -1.997424 -0.481519
H  0.383338 -0.675687 -2.155195
H  1.752224 -0.81316 1.776241
H  3.503131 -1.135133 1.893972
H  0.125281 1.826496 -1.568056
H  5.776731 1.096674 0.811034
H  5.597126 0.514302 -0.880827
H  5.223951 -0.569988 0.504696
H  2.668172 2.773275 -0.099061
H  4.103082 2.63772 -1.149711
H  4.306115 2.958264 0.614467
H  -0.499368 -2.777164 0.67513
H  2.826437 -3.465095 1.439359
H  -2.838012 3.029224 -1.225145
H  -4.955843 -0.880036 1.752231
H  -5.750211 0.652687 1.348877
