program: Gaussian 09
title: 000039152
version: EM64L-G09RevD.01
frameworkgroup: C1[X(C22H24NO5)]
method: RPBEPBE
basis: SDD
operation: Freq
keyword: #p
keyword: freq=noraman
keyword: PBEPBE/SDD
title: #p freq=noraman PBEPBE/SDD
converged: YES YES NO NO
title: Mulliken charges:
elementType: O O O O O N C C C C C C C C C C C C C C C C C C C C C C H H H H H H H H H H H H H H H H H H H H H H H H
charge: -0.249490 -0.155736 -0.236950 -0.234635 -0.229635 -0.108370 -0.062789 -0.396081 -0.083591 -0.085016 0.418106 0.293382 0.309288 -0.460290 -0.518463 0.303393 -0.541717 -0.564518 -0.556278 -0.379595 -0.390673 -0.381663 0.333941 -0.327376 -0.220836 -0.231132 -0.230036 -0.532180 0.284303 0.287420 0.305184 0.296625 0.298095 0.268149 0.265216 0.270962 0.242001 0.295133 0.308813 0.256184 0.321075 0.253134 0.276947 0.262383 0.277366 0.276837 0.239056 0.242505 0.246377 0.240313 0.237386 0.267476
chargesum: 1.00000
title: Mulliken charges with hydrogens summed into heavy atoms:
elementType: O O O O O N C C C C C C C C C C C C C C C C C C C C C C
charge: -0.249490 -0.155736 -0.236950 -0.234635 -0.229635 -0.108370 -0.062789 0.175642 -0.083591 -0.085016 0.418106 0.293382 0.309288 0.141520 -0.220368 0.303393 0.262610 0.281429 0.274114 -0.102648 -0.128290 -0.104297 0.333941 -0.050539 0.018219 0.011373 0.016341 0.212995
polarizability: 3.02835068e+02 2.49137726e+01 2.85977589e+02 -2.80933634e+01 5.95994093e+00 2.16548599e+02
1716.lowfreq: -5.7968 -2.0041 -0.0009 -0.0006 -0.0006 6.1037 15.5473 25.4642 29.1938
frequency: 15.4615 25.3499 29.1420 40.0180 48.1345 56.0516 66.8996 88.2990 111.3613 124.3249 134.9679 141.2543 148.6094 164.5658 184.6620 194.3582 210.2557 216.9228 231.0352 247.6490 253.0174 266.0284 275.3477 283.4783 291.0989 301.5894 316.6089 325.4840 347.0923 372.7935 402.3949 412.8702 416.5208 425.4484 430.0163 476.0885 493.6326 503.6477 510.4087 539.6092 554.0786 562.2204 589.5498 614.3463 651.6642 669.7873 679.2514 696.4436 706.3504 716.8793 730.2169 741.1305 770.5261 787.7594 830.5462 847.2339 859.8633 861.4759 884.9475 886.9381 891.9349 897.9762 938.1282 940.6270 947.5358 954.7095 964.9996 981.5861 985.6803 988.7979 989.6461 994.6210 1008.5796 1031.7442 1051.3068 1077.9329 1085.0326 1105.3326 1108.0651 1111.9023 1115.4060 1145.4524 1154.7180 1159.1840 1166.6871 1180.4235 1184.7989 1186.7199 1203.1225 1222.2773 1224.9882 1250.2937 1266.3981 1275.4037 1290.4957 1293.3947 1327.5164 1341.3761 1359.2798 1376.3313 1391.3165 1415.0707 1426.6853 1432.6596 1433.6123 1436.1030 1449.6781 1453.9894 1457.9659 1460.4356 1469.3093 1470.5162 1470.7912 1473.4762 1479.4963 1479.7791 1480.7356 1488.8073 1506.1354 1567.2533 1583.2908 1589.0982 1603.1591 1619.1919 1649.9328 1651.0721 2984.2559 3023.2903 3025.0467 3032.4438 3038.0327 3048.9441 3083.8818 3116.4024 3130.6638 3135.8285 3139.0266 3141.2936 3143.6854 3144.8992 3149.7806 3151.4001 3152.0946 3157.1330 3157.6216 3159.8521 3169.2069 3173.7853 3173.8343 3178.8472
redmass: 5.2575 4.0660 4.8745 3.5196 4.6411 3.9264 4.0596 4.6943 3.9486 5.0474 3.3768 4.8054 4.3986 4.6713 4.7742 1.9795 1.3983 1.8291 3.9830 2.2584 1.4201 5.4419 1.2926 2.0867 4.8000 5.3367 8.3238 3.9381 2.4369 3.3983 2.8599 3.0458 3.5029 2.3238 4.0688 4.4881 3.0909 4.0386 4.7440 6.3834 4.0671 6.2761 6.2350 6.4017 5.3145 4.0864 6.3358 5.6039 2.0872 5.4373 4.3282 4.8230 1.7763 4.0569 6.1510 2.8725 1.8035 1.2476 3.8481 3.8212 3.1428 2.0500 1.5279 2.4480 4.8891 4.6197 4.9201 1.8126 1.8128 2.3016 1.6924 2.7309 1.3251 2.3327 1.1973 2.0734 2.4798 1.3726 1.9215 1.2573 1.3012 2.2641 1.5770 2.4885 2.8539 1.0552 2.2386 1.5316 1.1251 1.9925 2.3959 1.2824 1.9701 1.8042 3.9598 1.5101 1.3694 1.2510 1.5484 6.5440 5.5487 1.1377 1.1420 1.0898 1.2885 2.1775 1.0536 1.1159 1.1220 1.6594 1.0617 1.7113 1.0924 1.0476 1.1941 2.0924 2.0776 1.0539 1.0575 8.0934 9.1495 6.1391 5.8147 7.6724 8.4475 11.9999 1.0322 1.0317 1.0323 1.0335 1.0593 1.0571 1.1054 1.1042 1.1107 1.0856 1.1054 1.0881 1.1054 1.1060 1.1060 1.1012 1.0924 1.0894 1.1058 1.0964 1.1047 1.0961 1.0981 1.0972
irintensity: 3.0659 0.1806 0.3176 5.1631 5.5810 0.3420 0.2527 3.6863 5.3210 1.8758 3.9452 10.0859 5.3702 5.3117 4.8596 1.2842 2.7440 2.9094 3.5624 1.4943 3.1096 3.0732 2.7550 8.0002 2.2194 2.3448 4.9375 13.3671 2.0828 4.2094 0.0702 1.6349 3.9544 0.4869 7.2729 10.8515 4.7747 7.8102 9.7516 0.8339 3.0288 82.4640 17.2422 0.4045 10.4495 0.6408 9.8478 4.4199 36.9327 7.0992 16.6478 0.5998 37.5309 0.1216 22.4299 9.7383 41.1373 0.1552 12.4854 23.8356 18.1625 19.6554 12.8326 43.1788 14.4310 107.8064 50.6922 0.0308 12.2008 2.8014 2.7923 16.4602 0.2281 18.5053 0.2907 7.6520 29.4833 11.2202 11.5109 0.0310 0.9406 51.7475 56.0714 30.8276 202.2561 0.5537 16.2147 44.2031 6.6460 7.3839 74.7375 56.0387 5.7605 83.7472 473.4042 23.3935 4.3638 10.6374 62.4300 0.3483 3.1638 38.2025 12.5041 11.3168 15.8843 16.9292 0.6040 53.9318 8.1669 33.3414 13.3381 40.0257 17.3262 13.7002 55.7041 67.3792 22.6554 59.5220 132.4202 391.7374 216.2422 41.8269 6.5485 42.9674 173.4003 186.7509 38.1269 4.5766 9.8166 20.1027 0.6575 5.7428 26.7053 0.1935 3.3266 0.4637 1.7013 2.5330 4.8353 2.8573 5.1503 12.0992 3.1062 1.3015 2.7013 11.9609 0.8389 11.7811 9.7455 2.2995
temp: 298.150 k
press: 1.00000 atm
elementType: 8 8 8 8 8 7 6 6 6 6 6 6 6 6 6 6 6 6 6 6 6 6 6 6 6 6 6 6 1 1 1 1 1 1 1 1 1 1 1 1 1 1 1 1 1 1 1 1 1 1 1 1
symmnumber: 1
zpe: 1096347.1 jmol-1
zpe.correction: 0.417577 hartree
zpe.thermalcorrener: 0.444471 hartree
zpe.thermalcorrenthalpy: 0.445415 hartree
zpe.thermalcorrgfe: 0.359077 hartree
zpe.sumelectzpe: -1281.321174 hartree
zpe.sumelectthermal: -1281.294280 hartree
zpe.sumelectthermalent: -1281.293336 hartree
zpe.sumelectthermalfe: -1281.379674 hartree
dipole: 10.5364 -7.6342 -1.0830
dipole: 13.0564
quadrupole: -40.4394 -123.3985 -154.0446
quadrupole: -24.0990 -6.5683 -3.1327
quadrupole: 65.5215 -17.4377 -48.0838 -24.0990 -6.5683 -3.1327
hfenergy: -1281.7387508 hartree
pointgroup: C01 [X(C22H24N1O5)]
dipole: 4.9554848 -0.7520339 1.1244006 debye
polarizability: 263.4450563|0.3843792|309.8095205|29.1075954|-34.0801747|232.1066791 unknown
InChI: InChI=1S/C22H24NO5/c1-23(2,3)13-19(24)28-14-22(15-8-6-5-7-9-15)20(25)17-11-10-16(27-4)12-18(17)21(22)26/h5-12H,13-14H2,1-4H3
charge 1 multiplicity 1
52 atoms
O  1.428817 -1.552789 -1.296236
O  -1.206476 0.51023 -2.91145
O  0.8764 -0.363292 1.282792
O  -0.59582 5.66751 -0.896708
O  1.778608 -3.371207 0.136713
N  4.33055 -2.183506 0.932988
C  -0.710603 -0.479578 -0.666434
C  -0.065953 -1.742345 -1.278189
C  -0.895675 0.670117 -1.705888
C  0.144428 0.225233 0.429655
C  -2.108667 -0.883907 -0.113412
C  -0.608893 1.954772 -1.00948
C  -0.001583 1.679932 0.246217
C  3.55475 -1.697474 -0.299698
C  -0.834248 3.26281 -1.46567
C  2.161835 -2.327786 -0.435597
C  5.600618 -1.33773 1.035482
C  3.500139 -1.989526 2.213358
C  4.720904 -3.659158 0.786839
C  0.402302 2.745232 1.089046
C  -2.274993 -1.219615 1.254954
C  -3.211205 -1.001585 -0.998808
C  -0.4402 4.32655 -0.607492
C  0.173784 4.060234 0.660575
C  -3.533149 -1.648597 1.731985
C  -4.465379 -1.437657 -0.516005
C  -4.632356 -1.758312 0.849852
C  -1.237757 6.049188 -2.170248
H  -0.372782 -1.857053 -2.330191
H  -0.294213 -2.64773 -0.694754
H  3.435182 -0.606009 -0.215762
H  4.161871 -1.920055 -1.194743
H  -1.292689 3.430703 -2.443764
H  6.215827 -1.721051 1.863287
H  6.162316 -1.407604 0.091218
H  5.321302 -0.291583 1.232606
H  4.168702 -2.140363 3.074392
H  3.07024 -0.976417 2.21615
H  2.683263 -2.722522 2.218698
H  5.265717 -3.964891 1.693008
H  3.802324 -4.250565 0.671537
H  5.368409 -3.770532 -0.097159
H  0.86535 2.54576 2.060088
H  -1.430128 -1.153443 1.948009
H  -3.097517 -0.753892 -2.059513
H  0.450833 4.9206 1.276893
H  -3.653436 -1.900238 2.791164
H  -5.309567 -1.525329 -1.208026
H  -5.606454 -2.09187 1.222619
H  -2.268501 5.654039 -2.222229
H  -0.643516 5.691288 -3.030695
H  -1.256115 7.147015 -2.156575
