program: Gaussian 09
title: 000005542
version: EM64L-G09RevD.01
frameworkgroup: C1[X(C11H17N3O)]
method: RPBEPBE
basis: SDD
operation: Freq
keyword: #p
keyword: freq=noraman
keyword: PBEPBE/SDD
title: #p freq=noraman PBEPBE/SDD
converged: YES YES NO NO
title: Mulliken charges:
elementType: O N N N C C C C C C C C C C C H H H H H H H H H H H H H H H H H
charge: -0.260231 0.037342 -0.317265 0.119287 -0.431793 -0.348441 -0.170189 -0.684515 -0.190255 -0.549636 -0.145934 -0.215196 -0.186327 -0.214121 -0.235145 0.203384 0.195468 0.212477 0.197048 0.223439 0.211735 0.208713 0.219491 0.243662 0.214299 0.213332 0.237276 0.235719 0.220409 0.259940 0.211762 0.284269
chargesum: 0.00000
title: Mulliken charges with hydrogens summed into heavy atoms:
elementType: O N N N C C C C C C C C C C C
charge: -0.260231 0.037342 -0.032996 0.119287 -0.032942 0.061084 0.053250 -0.044577 0.053407 -0.122006 0.091342 0.020523 0.034082 0.045819 -0.023383
polarizability: 4.67915021e+02 -3.61497042e+01 1.02837023e+02 -2.62799847e+01 -8.90559259e+00 1.09726901e+02
1716.lowfreq: -4.3359 -0.0006 -0.0005 0.0011 5.4320 7.9352 19.6690 29.2790 49.2470
frequency: 17.5942 29.1846 49.2116 53.5216 70.1950 82.6397 90.9843 120.9598 146.7048 152.7036 202.4122 217.4535 226.5758 244.2401 274.4659 285.4143 303.1089 324.7551 354.8507 397.5915 427.7976 461.5855 504.2175 545.0341 565.3734 661.3010 736.3661 743.2583 779.9797 820.7408 871.1211 885.1658 890.5340 900.7165 917.0343 950.0240 976.5439 979.0665 1005.1574 1007.9908 1037.6045 1060.9250 1093.3488 1097.8411 1099.8489 1120.5585 1170.6642 1186.2499 1205.4718 1220.4625 1235.9201 1260.2473 1268.7688 1274.0646 1277.8154 1285.9197 1295.4238 1296.6749 1315.3610 1321.7289 1343.9595 1358.4522 1388.8369 1448.0452 1450.2915 1458.6449 1472.7686 1476.7831 1484.8569 1530.5155 1617.3797 1639.0034 1676.2699 2953.4333 2962.1639 2973.1397 2977.5066 2980.8097 3012.3387 3020.0391 3036.5164 3063.2237 3071.6516 3074.8676 3080.3802 3085.3992 3089.6497 3098.0358 3134.5463 3184.6002
redmass: 5.0116 2.2555 5.8176 4.1894 2.4157 2.8230 3.1728 4.6544 3.4639 4.0102 2.5542 4.2677 1.2314 3.0151 3.4140 2.4287 2.6660 3.4426 3.2366 4.2458 3.8208 4.5235 3.0171 3.2678 3.3165 4.7197 1.1204 1.2939 1.4931 1.5332 1.3781 1.8819 1.7735 1.9720 1.4888 1.1835 3.7913 1.2243 1.8172 1.1336 3.5686 2.1586 2.2957 4.0466 2.7843 1.7277 1.8625 2.0862 1.6634 1.3820 1.2997 1.2652 1.3134 1.7749 1.1774 1.4786 1.2004 1.3604 1.3529 1.6912 1.5187 2.7632 1.2125 1.4209 1.2303 1.0875 1.0588 1.0430 1.0773 5.8211 5.1524 5.7068 6.5042 1.0619 1.0586 1.0358 1.0614 1.0882 1.0953 1.1000 1.1012 1.0928 1.1009 1.0992 1.0912 1.0935 1.0896 1.0878 1.0908 1.0730
irintensity: 0.8950 2.8927 0.1907 4.6648 9.9718 0.6677 0.0417 4.8345 5.7690 1.9019 1.1312 0.2714 0.1219 0.6758 3.0181 1.7495 2.9932 1.5673 2.3274 3.7679 11.7889 5.5271 3.5274 0.8849 12.7150 3.3560 8.0639 92.0246 2.6644 8.1860 4.8906 32.8656 14.0863 30.4155 5.6951 2.0268 530.0988 68.0793 7.7504 136.6664 16.0794 22.3948 5.2964 8.6136 19.9144 1.6748 15.9463 28.3291 82.3468 24.8024 16.5060 1.7858 4.0239 38.4596 0.3183 58.1347 4.2098 12.5413 26.0052 56.5079 5.3685 105.1456 10.4436 43.3842 29.0345 3.8800 3.6047 12.7533 15.3093 42.2120 67.9747 143.3826 6.1128 24.0352 27.4099 53.6639 36.0204 43.0906 4.3051 14.3679 13.3010 11.8777 90.6559 56.0069 3.9381 2.7217 39.1560 51.3546 13.5822 13.1803
temp: 298.150 k
press: 1.00000 atm
elementType: 8 7 7 7 6 6 6 6 6 6 6 6 6 6 6 1 1 1 1 1 1 1 1 1 1 1 1 1 1 1 1 1
symmnumber: 1
zpe: 685116.8 jmol-1
zpe.correction: 0.260947 hartree
zpe.thermalcorrener: 0.278504 hartree
zpe.thermalcorrenthalpy: 0.279448 hartree
zpe.thermalcorrgfe: 0.212601 hartree
zpe.sumelectzpe: -667.544792 hartree
zpe.sumelectthermal: -667.527235 hartree
zpe.sumelectthermalent: -667.526291 hartree
zpe.sumelectthermalfe: -667.593139 hartree
dipole: -7.5561 -0.0013 2.6354
dipole: 8.0025
quadrupole: -145.3213 -90.9381 -87.7832
quadrupole: 0.3856 12.2244 -1.9854
quadrupole: -37.3071 17.0761 20.2310 0.3856 12.2244 -1.9854
hfenergy: -667.8057395 hartree
pointgroup: C01 [X(C11H17N3O1)]
dipole: -2.9705844 -0.0205211 -1.0429765 debye
polarizability: 467.5802566|37.5797046|102.8573266|26.633599|-8.6664967|110.0413615 unknown
InChI: InChI=1S/C11H17N3O/c1-2-3-4-5-6-7-8-9-10-11-12-13-14-15/h4-5,7-11,13H,2-3,6H2,1H3
charge 0 multiplicity 1
32 atoms
O  8.102113 1.034087 -0.148099
N  4.832767 0.001299 0.442727
N  5.944554 0.547621 -0.149514
N  7.161798 0.480629 0.532391
C  -5.76773 0.806199 -0.300871
C  -7.132666 0.269337 0.212169
C  -4.72069 -0.278155 -0.437632
C  -8.205437 1.376134 0.29696
C  -3.530008 -0.305551 0.217019
C  -2.486516 -1.407737 0.079459
C  -1.175505 -0.877706 -0.462056
C  0.027253 -0.93489 0.195691
C  1.265168 -0.398822 -0.338188
C  2.481146 -0.457823 0.313474
C  3.695095 0.087806 -0.240728
H  -5.403441 1.599385 0.381278
H  -5.936183 1.287957 -1.287974
H  -6.986367 -0.193377 1.207612
H  -7.482406 -0.539229 -0.461159
H  -4.972161 -1.110868 -1.115888
H  -7.88841 2.183944 0.983117
H  -8.38641 1.83096 -0.695448
H  -9.167616 0.977187 0.666689
H  -3.267097 0.520683 0.894977
H  -2.883761 -2.189023 -0.600701
H  -2.308549 -1.889986 1.06154
H  -1.223674 -0.392709 -1.449585
H  0.071606 -1.411306 1.186511
H  1.213752 0.083777 -1.327017
H  2.563963 -0.932394 1.299286
H  3.638158 0.573581 -1.236287
H  5.943253 1.01679 -1.084352
