program: Gaussian 09
title: 000005530
version: EM64L-G09RevD.01
frameworkgroup: C1[X(C9H11N)]
method: RPBEPBE
basis: SDD
operation: Freq
keyword: #pfreq=noraman
keyword: PBEPBE/SDD
title: #p freq=noraman PBEPBE/SDD
converged: YES YES NO NO
title: Mulliken charges:
elementType: N C C C C C C C C C H H H H H H H H H H H
charge: -0.597890 -0.351422 -0.184812 -0.518149 0.573223 -0.435865 -0.421762 -0.229614 -0.242565 -0.250833 0.259279 0.247996 0.235252 0.248678 0.272283 0.273815 0.229182 0.223453 0.222645 0.220930 0.226174
chargesum: 0.00000
title: Mulliken charges with hydrogens summed into heavy atoms:
elementType: N C C C C C C C C C
charge: -0.051791 -0.092143 0.063184 -0.034220 0.573223 -0.206682 -0.198308 -0.006969 -0.021635 -0.024658
polarizability: 1.44038116e+02 1.78648813e+00 9.71074622e+01 -6.04723606e+00 1.87147242e+00 6.10528248e+01
1716.lowfreq: -19.2185 -9.1767 -0.0001 0.0004 0.0006 2.8945 50.5298 105.4073 155.4721
frequency: 50.4131 105.3989 155.4572 217.7600 293.0211 333.8115 367.6798 405.1554 430.2851 524.8690 531.0102 573.9548 616.4516 701.9111 747.1818 753.2469 801.8993 842.4388 858.2398 892.4163 924.9725 961.4385 969.1363 988.0435 988.7989 1029.0364 1045.3005 1066.6592 1071.4261 1100.8689 1143.9943 1170.8450 1190.5248 1203.4154 1219.2954 1231.6360 1310.3727 1334.7944 1380.4716 1401.9964 1434.3128 1455.2608 1490.5253 1587.5604 1615.9521 1635.4680 3008.4702 3098.2732 3113.7284 3115.3862 3130.8106 3133.2000 3141.3662 3161.1432 3206.9744 3477.2012 3603.7161
redmass: 3.3360 3.7891 3.0927 1.6104 1.9844 3.0145 3.3787 2.8071 2.3685 2.2272 1.4971 3.4664 6.4123 1.7087 2.2564 2.8644 2.0527 1.2597 3.1527 1.3553 1.7947 1.8985 1.4236 2.7955 1.7552 2.0231 1.2960 1.7619 1.0491 1.5520 2.0503 1.0531 1.1165 1.5468 1.8927 1.4961 1.6832 1.3411 5.2468 1.8517 1.6029 1.8259 2.5249 5.9297 6.1071 1.1009 1.0873 1.0566 1.0853 1.0874 1.0909 1.0897 1.0959 1.1014 1.1158 1.0442 1.0995
irintensity: 0.8326 0.6467 0.6887 26.1052 24.3516 9.6759 2.9087 0.0910 10.6918 43.4861 229.2868 4.8082 0.5137 48.8152 14.3477 27.3806 10.9505 0.2580 29.6430 3.0692 7.1178 4.4272 1.1652 0.0670 0.0803 5.7221 7.9140 7.0742 12.6959 9.0202 2.6371 0.2596 1.4659 23.1958 0.6462 8.5777 2.7360 4.7432 3.7578 22.3753 7.7681 26.1203 49.3685 1.5948 31.9393 24.5618 52.5949 13.4106 13.2914 2.5806 5.5833 12.2833 53.2588 24.0103 12.4564 0.2326 2.3657
temp: 298.150 k
press: 1.00000 atm
elementType: 7 6 6 6 6 6 6 6 6 6 1 1 1 1 1 1 1 1 1 1 1
symmnumber: 1
zpe: 462625.7 jmol-1
zpe.correction: 0.176205 hartree
zpe.thermalcorrener: 0.185319 hartree
zpe.thermalcorrenthalpy: 0.186263 hartree
zpe.thermalcorrgfe: 0.141863 hartree
zpe.sumelectzpe: -403.537201 hartree
zpe.sumelectthermal: -403.528087 hartree
zpe.sumelectthermalent: -403.527142 hartree
zpe.sumelectthermalfe: -403.571543 hartree
dipole: -1.0572 -0.5348 -0.8921
dipole: 1.4831
quadrupole: -51.8166 -55.3394 -61.5955
quadrupole: 2.0717 2.1054 -0.0544
quadrupole: 4.4339 0.9111 -5.3450 2.0717 2.1054 -0.0544
hfenergy: -403.7134059 hartree
pointgroup: C01 [X(C9H11N1)]
dipole: 0.397428 -0.0567089 0.4234369 debye
dipolederiv: -0.7145498 -0.203689 0.0082468 -0.2856792 -0.3517688 0.122141 0.1045581 0.1597087 -0.6470731 -0.4958543 0.0831727 -0.0850206 0.2878532 0.0170643 0.0393927 -0.2886729 0.0517154 0.0449439 0.772806 0.2095027 0.0192079 -0.0230031 0.2923542 -0.0303937 0.0648287 0.0232826 0.2122077 0.039358 0.0598458 -0.0285853 0.0489741 -0.1011089 -0.1068196 0.2198244 -0.1545981 -0.0492114 0.7422329 -0.0671771 -0.0170606 0.0144257 -0.0705534 0.0327033 -0.1280147 0.034315 -0.0370517 -0.2808628 0.0508101 -0.0349413 0.1390631 -0.0055524 -0.1188116 -0.0760623 -0.110311 -0.0875993 -0.1851671 -0.0263727 -0.0000947 -0.2085868 -0.0199968 -0.0760796 0.1425619 -0.0894219 -0.1310558 0.0969778 -0.0529964 0.0017629 -0.0619471 0.0375911 -0.1015983 0.0040461 -0.1058058 -0.0782927 0.0366314 -0.0055641 -0.0245837 0.0707692 0.0405914 -0.1263687 -0.0633728 -0.1184341 -0.0689391 -0.009544 0.0080209 -0.0438671 -0.0338647 -0.142472 -0.0274232 -0.0056771 -0.0299385 -0.1643842 -0.0057823 0.0159274 0.0112797 -0.0171312 -0.0372372 0.094151 0.0331092 0.0787711 0.0498752 -0.1149531 -0.1187041 0.0716359 -0.0661235 0.0133533 0.063214 0.0638393 0.049135 -0.1281854 0.033576 -0.1064311 0.020686 -0.0514831 -0.0687083 -0.0284268 0.0180209 0.0205421 0.0791419 -0.0519428 0.03229 0.1180798 0.0298786 0.0719967 -0.0060941 0.0776161 -0.0323295 0.0294376 0.0512216 0.0349344 -0.0863694 0.0785778 0.1231586 -0.0152474 -0.2158646 -0.0150334 0.2816567 0.1433053 0.0109299 -0.0152174 -0.0059624 0.1373585 -0.1380853 -0.0200714 -0.1817363 0.2138525 0.0405699 -0.0795068 0.0687569 -0.0585767 -0.0042632 0.104504 0.0532812 0.106805 0.0698707 0.0128099 0.1078194 -0.0427529 0.1050142 -0.0056597 0.0726056 -0.0511358 0.0681988 0.0998747 -0.0022978 0.0997411 -0.0396657 0.1127782 -0.0163438 0.0919077 -0.0462169 0.0928882 0.1031971 0.0334092 -0.0571397 0.0538494 -0.0767345 -0.0186291 0.1194034 0.0686166 0.1168154 0.0715848 -0.1419441 0.0045863 0.0446537 0.0017582 0.1088254 0.0353255 0.0447859 0.0354311 0.1361496 unknown
polarizability: 143.8047545|-6.3088923|89.3448368|-2.4924085|-15.3091045|69.0488115 unknown
InChI: InChI=1S/C9H11N/c10-9-6-8(9)7-4-2-1-3-5-7/h1-5,8-9H,6,10H2
charge 0 multiplicity 1
21 atoms
N  3.542142 0.585281 0.721782
C  1.306174 0.202437 -0.476869
C  2.333098 -0.197062 0.618281
C  2.165963 -1.072342 -0.621332
C  -0.164867 0.145513 -0.225432
C  -1.002255 1.174099 -0.737647
C  -0.772946 -0.897923 0.526431
C  -2.395311 1.16446 -0.508307
C  -2.165305 -0.907309 0.760639
C  -2.985493 0.123094 0.244817
H  1.640031 1.044203 -1.092514
H  1.871552 -0.584665 1.543429
H  1.665768 -2.039936 -0.517198
H  2.970709 -1.039155 -1.361006
H  4.398772 0.055037 0.897483
H  3.46859 1.441915 1.275013
H  -0.553539 1.987052 -1.322171
H  -0.159173 -1.713777 0.928205
H  -3.01971 1.967591 -0.916662
H  -2.612853 -1.721167 1.343039
H  -4.066348 0.112855 0.424019
