program: Gaussian 09
title: 000005543
version: EM64L-G09RevD.01
frameworkgroup: C1[X(C10H16Cl3NOS)]
method: RPBEPBE
basis: SDD
operation: Freq
keyword: #p
keyword: freq=noraman
keyword: PBEPBE/SDD
title: #p freq=noraman PBEPBE/SDD
converged: YES YES NO NO
title: Mulliken charges:
elementType: Cl Cl Cl S O N C C C C C C C C C C H H H H H H H H H H H H H H H H
charge: -0.000004 0.075686 0.028715 0.087923 -0.257552 -0.121509 -0.087566 -0.001860 -0.662021 -0.664661 -0.700351 -0.697647 0.018622 -0.724112 0.315244 -0.402541 0.235709 0.197319 0.222208 0.209950 0.236504 0.238988 0.222104 0.209820 0.210822 0.264290 0.220912 0.223052 0.209628 0.264926 0.340410 0.286991
chargesum: 0.00000
title: Mulliken charges with hydrogens summed into heavy atoms:
elementType: Cl Cl Cl S O N C C C C C C C C C C
charge: -0.000004 0.075686 0.028715 0.087923 -0.257552 -0.121509 0.148142 0.195459 0.006641 0.006251 -0.004326 -0.000040 0.018622 -0.096711 0.315244 -0.402541
polarizability: 2.38971943e+02 -1.22272145e+01 1.53275190e+02 -7.25934967e-01 6.04199903e+00 1.32516267e+02
1716.lowfreq: -5.3700 -2.5989 -0.0027 -0.0021 0.0006 8.7141 17.0168 21.5469 30.2250
frequency: 16.9918 21.5004 30.1679 49.6366 76.0199 79.9520 90.4449 107.8775 130.8532 159.9066 180.0280 191.6787 199.7130 211.3719 216.8148 231.8139 237.6990 260.3012 274.9081 315.3462 325.2896 328.0509 354.0167 373.4748 392.8114 428.1650 473.5949 486.2448 497.7298 522.8664 552.7972 599.2493 626.8025 656.9113 704.9187 785.7719 835.8280 870.0905 900.8914 913.7563 923.8043 925.6666 939.8101 944.0427 1021.1716 1096.4510 1111.7746 1133.0056 1149.9300 1151.4546 1169.7848 1200.5637 1203.0416 1241.6453 1267.5254 1295.6931 1311.7561 1367.0483 1375.9439 1379.2193 1389.6569 1396.0396 1408.0982 1441.5568 1455.6907 1465.2183 1468.2063 1470.6427 1479.2148 1481.1417 1485.0401 1498.2985 1625.0276 1631.7677 2976.7396 2984.8509 2987.7865 2989.8423 2992.5710 3020.2910 3025.4135 3077.7721 3080.9663 3085.5373 3087.1788 3092.4321 3096.4998 3108.9556 3114.4421 3119.4911
redmass: 7.5455 9.2712 6.1576 3.0418 6.4274 3.9158 4.5192 7.4845 9.0275 2.4147 7.6275 7.1312 1.1538 1.5301 1.5662 1.1636 1.2914 3.1995 9.0475 6.6448 3.1394 2.8632 12.8026 2.5502 3.6300 5.0746 7.1993 2.8358 4.6764 3.9274 11.4552 3.1686 9.9744 6.5585 6.0716 3.2176 6.7964 2.6184 2.4405 1.2153 1.2141 1.9471 1.3751 1.4164 1.9531 5.0666 1.8838 2.2695 2.3331 2.2864 2.0367 1.9355 1.4140 1.3553 2.3233 1.4386 1.3696 1.2320 1.2117 1.2046 1.2584 1.2180 1.4018 1.0951 1.0437 1.0477 1.0505 1.0524 1.0465 1.0497 1.0552 1.0559 10.0771 8.5736 1.0674 1.0353 1.0362 1.0360 1.0370 1.0838 1.0842 1.0996 1.0996 1.0991 1.0983 1.1008 1.1004 1.1001 1.0994 1.0958
irintensity: 0.5001 0.1987 0.6327 0.0146 0.1655 0.6907 2.2902 0.1894 0.1859 0.1739 0.9137 0.5096 0.1438 1.6813 1.8102 0.0830 2.2139 8.6137 3.1923 1.0564 3.2127 0.0893 1.6040 18.9066 2.6985 1.4355 12.7007 7.4589 4.9623 8.1304 53.8841 46.6041 9.9286 32.4651 33.2776 79.1439 108.6977 3.7011 11.6423 3.7461 3.1861 25.1869 0.0496 0.0393 74.3324 5.8058 17.9942 1.2689 19.7983 33.7806 27.4206 76.2705 12.4627 76.4605 291.6185 4.0405 0.7043 6.2509 6.7757 49.2659 46.2041 1.9089 36.6648 26.7550 0.7660 0.2077 4.1712 27.0835 11.1865 1.5260 13.9195 15.2755 39.9382 215.2033 66.1684 14.4434 21.7972 30.8685 25.9015 22.6570 9.6873 2.8574 11.0771 93.1987 29.1132 17.0304 41.5625 2.8706 26.4698 8.8930
temp: 298.150 k
press: 1.00000 atm
elementType: 17 17 17 16 8 7 6 6 6 6 6 6 6 6 6 6 1 1 1 1 1 1 1 1 1 1 1 1 1 1 1 1
symmnumber: 1
zpe: 642741.5 jmol-1
zpe.correction: 0.244807 hartree
zpe.thermalcorrener: 0.265208 hartree
zpe.thermalcorrenthalpy: 0.266152 hartree
zpe.thermalcorrgfe: 0.192794 hartree
zpe.sumelectzpe: -2297.593095 hartree
zpe.sumelectthermal: -2297.572695 hartree
zpe.sumelectthermalent: -2297.571751 hartree
zpe.sumelectthermalfe: -2297.645109 hartree
dipole: -4.4447 -1.2880 1.0891
dipole: 4.7540
quadrupole: -112.8838 -125.7692 -124.5545
quadrupole: 1.0172 -6.0694 0.8203
quadrupole: 8.1853 -4.7000 -3.4853 1.0172 -6.0694 0.8203
hfenergy: -2297.8379028 hartree
pointgroup: C01 [X(C10H16Cl3N1O1S1)]
dipole: 1.7110506 0.7331501 -0.1816924 debye
polarizability: 240.4053521|-4.9304447|136.736415|1.992756|-9.8544841|147.6216329 unknown
InChI: InChI=1S/C10H16Cl3NOS/c1-6(2)14(7(3)4)10(15)16-5-8(11)9(12)13/h6-7H,5H2,1-4H3
charge 0 multiplicity 1
32 atoms
Cl -2.222075 -1.060545 2.009611
Cl -5.335469 -0.121346 1.686579
Cl -4.901881 0.396986 -1.254518
S  -0.576147 0.761274 -0.590582
O  0.746552 -1.66942 -0.453871
N  2.125311 0.196952 -0.137678
C  2.280138 1.681313 -0.013611
C  3.363831 -0.654535 0.007882
C  3.161033 2.253093 -1.148737
C  2.7908 2.078444 1.391283
C  3.673253 -1.444172 -1.284177
C  3.290663 -1.56532 1.254617
C  0.924828 -0.423671 -0.366974
C  -1.896135 -0.598147 -0.724154
C  -2.883133 -0.540229 0.398103
C  -4.182756 -0.152164 0.314259
H  1.271321 2.116388 -0.127056
H  4.181403 0.073034 0.164041
H  3.1946 3.354882 -1.074404
H  4.200971 1.883111 -1.090006
H  2.749633 1.984699 -2.13718
H  2.121473 1.685469 2.175944
H  2.817796 3.179447 1.477905
H  3.813202 1.704042 1.581825
H  4.637953 -1.971888 -1.171305
H  2.887766 -2.190521 -1.483259
H  3.748407 -0.76728 -2.153738
H  3.096674 -0.974058 2.167013
H  4.252783 -2.094469 1.38275
H  2.491079 -2.315302 1.14427
H  -1.311204 -1.539451 -0.70258
H  -2.386368 -0.475718 -1.69995
