program: Gaussian 09
title: 000039096
version: EM64L-G09RevD.01
frameworkgroup: C1[X(C16H15NO4)]
method: RPBEPBE
basis: SDD
operation: Freq
keyword: #p
keyword: freq=noraman
keyword: PBEPBE/SDD
title: #p freq=noraman PBEPBE/SDD
converged: YES YES NO NO
title: Mulliken charges:
elementType: O O O O N C C C C C C C C C C C C C C C C H H H H H H H H H H H H H H H
charge: -0.271143 -0.264095 -0.208051 -0.238520 -0.020577 -0.264209 0.460500 0.250688 -0.358647 -0.440661 -0.354914 -0.219835 -0.228329 0.110819 -0.239223 -0.294257 0.315001 -0.183420 -0.760923 -0.179294 -0.360002 0.280376 0.265074 0.242376 0.258753 0.267843 0.230243 0.232008 0.232445 0.267499 0.241665 0.231764 0.242396 0.250450 0.260131 0.246071
chargesum: 0.00000
title: Mulliken charges with hydrogens summed into heavy atoms:
elementType: O O O O N C C C C C C C C C C C C C C C C
charge: -0.271143 -0.264095 -0.208051 -0.238520 -0.020577 0.016167 0.460500 0.250688 -0.093573 -0.198286 0.171682 0.010409 0.003679 0.110819 -0.006778 -0.026758 0.315001 0.058244 -0.004271 0.052470 -0.117607
polarizability: 1.99476639e+02 -1.98316796e+01 2.06545686e+02 -4.26062704e+00 -4.88521331e+00 1.39491253e+02
1716.lowfreq: -8.5615 -3.2457 0.0000 0.0004 0.0005 6.9690 9.9100 22.4735 23.7255
frequency: 8.0213 22.4184 23.6342 32.6216 39.2612 61.6291 64.8762 81.2966 82.8162 102.9982 168.1431 199.1148 217.0412 230.0177 259.9909 270.8256 287.3430 321.2476 400.8862 402.2840 422.4903 456.1580 488.6399 505.5847 558.5660 574.0475 584.7619 613.4011 614.7766 625.9758 669.0547 697.9602 708.4103 741.0738 760.2838 770.0402 803.9430 830.7354 855.9898 865.3120 878.0279 907.5536 932.3238 945.9827 958.2148 963.7583 981.1279 983.6789 990.5792 999.8992 1003.0998 1007.1544 1024.5549 1027.4512 1040.4867 1043.1054 1084.4140 1090.7270 1114.2952 1167.5910 1174.0947 1187.2870 1193.6691 1197.2504 1227.6982 1238.9093 1262.3695 1278.3283 1299.9505 1316.6450 1332.6825 1349.0988 1383.8810 1385.7285 1413.9130 1441.8644 1442.0906 1453.1130 1454.1619 1456.6534 1483.7459 1568.9944 1585.7349 1594.9212 1612.8985 1654.9714 1664.0663 3007.6639 3026.4757 3055.2700 3101.0268 3101.8571 3126.0097 3129.3602 3133.3045 3142.7456 3142.9827 3145.4842 3157.2929 3165.7115 3168.9380 3178.3195
redmass: 4.7096 4.1608 6.1319 4.6362 5.4567 2.7615 1.7061 2.7579 4.2163 7.8893 4.7293 5.3288 5.3861 4.8047 4.7209 4.7253 4.8298 6.2118 2.8420 3.2832 4.3884 2.7278 4.4134 4.9231 3.5578 4.8495 6.5132 6.4015 5.9245 5.9512 6.2977 3.2796 2.1171 3.4477 1.3305 1.9354 4.7746 4.5955 1.2677 5.2829 4.1778 1.2799 1.6317 4.2704 1.5548 6.5035 1.3899 3.1511 6.2904 1.4451 2.1887 1.3859 2.2346 2.1506 2.3484 1.6550 1.6146 1.6393 3.8427 1.0789 1.0580 1.2645 1.8326 2.2373 1.1359 2.7243 2.2517 1.5259 1.3689 5.9780 1.2841 1.4543 1.4776 3.9982 1.8640 1.9996 1.2189 1.0556 1.0552 2.1464 2.3236 5.9278 5.6470 6.2097 6.0442 10.0158 10.3265 1.0381 1.0586 1.0850 1.0945 1.1047 1.0856 1.0882 1.0884 1.1022 1.0903 1.0926 1.0963 1.0963 1.1012 1.0989
irintensity: 0.1374 0.7486 0.4183 1.0394 1.2944 0.7284 1.7196 1.7204 2.3104 1.4125 3.5373 0.6699 8.2321 6.5155 7.1897 2.3158 5.5943 9.4415 1.1146 3.3529 10.4452 4.3652 12.6867 22.4943 1.8779 1.6006 12.9388 0.4151 3.0929 4.5543 9.8119 10.6084 61.8957 12.6808 52.6539 49.9001 2.2692 9.6035 0.6057 26.6168 9.5835 0.4534 8.4834 38.3135 4.6445 3.1744 0.0665 43.7909 3.6602 32.2365 133.2912 10.0347 7.0121 3.3301 3.2351 11.1641 9.9177 7.5852 414.0508 5.4810 0.3267 70.6550 148.7214 123.9038 10.7248 1.0187 21.4696 0.5397 22.2241 4.5639 0.7521 7.5892 43.5335 17.5110 15.4945 8.8307 31.6802 20.4658 20.5928 34.5649 13.7606 11.5184 34.8221 3.8033 3.4854 211.0255 121.8145 1.0874 15.1055 3.1994 7.5116 2.4938 1.4434 11.1188 2.0807 8.4392 14.4610 21.2702 20.7944 23.6218 12.5152 5.8529
temp: 298.150 k
press: 1.00000 atm
elementType: 8 8 8 8 7 6 6 6 6 6 6 6 6 6 6 6 6 6 6 6 6 1 1 1 1 1 1 1 1 1 1 1 1 1 1 1
symmnumber: 1
zpe: 723769.8 jmol-1
zpe.correction: 0.275669 hartree
zpe.thermalcorrener: 0.295284 hartree
zpe.thermalcorrenthalpy: 0.296228 hartree
zpe.thermalcorrgfe: 0.221995 hartree
zpe.sumelectzpe: -972.842360 hartree
zpe.sumelectthermal: -972.822746 hartree
zpe.sumelectthermalent: -972.821802 hartree
zpe.sumelectthermalfe: -972.896035 hartree
dipole: -0.7140 4.3555 -0.1606
dipole: 4.4165
quadrupole: -104.8317 -120.7890 -120.3952
quadrupole: -6.6264 -3.2054 0.7285
quadrupole: 10.5069 -5.4504 -5.0565 -6.6264 -3.2054 0.7285
hfenergy: -973.1180297 hartree
pointgroup: C01 [X(C16H15N1O4)]
dipole: 0.4712026 -1.6704827 -0.0818536 debye
polarizability: 186.2897392|9.6874834|220.5883851|1.8624846|1.2171907|138.6354537 unknown
InChI: InChI=1S/C16H15NO4/c1-12(18)21-15(13-7-3-2-4-8-13)16(19)20-11-14-9-5-6-10-17-14/h2-10,15H,11H2,1H3
charge 0 multiplicity 1
36 atoms
O  2.670551 1.644135 -0.022561
O  -0.856452 1.157559 -0.786387
O  0.137492 1.854323 1.21892
O  1.911475 3.662613 -0.908037
N  -4.242091 0.280929 0.438523
C  1.515733 0.975526 -0.664049
C  1.72523 -0.525272 -0.545881
C  0.220983 1.404762 0.060765
C  2.099362 -1.095176 0.696884
C  1.509801 -1.362358 -1.66631
C  -2.218877 1.410344 -0.253837
C  2.262622 -2.492502 0.811363
C  1.668404 -2.762076 -1.548079
C  -2.936677 0.109295 0.065854
C  2.045963 -3.329738 -0.309216
C  -2.318478 -1.160291 -0.009313
C  2.730786 3.041693 -0.197671
C  -3.083291 -2.301419 0.324408
C  3.878937 3.621436 0.590291
C  -4.431071 -2.139052 0.716588
C  -4.964831 -0.829856 0.755871
H  1.431845 1.293536 -1.71735
H  2.269877 -0.441646 1.558688
H  1.218831 -0.922484 -2.627382
H  -2.752536 1.9588 -1.04625
H  -2.14849 2.043808 0.648602
H  2.55742 -2.929121 1.771914
H  1.504793 -3.404426 -2.420255
H  2.174726 -4.414086 -0.218398
H  -1.276534 -1.250485 -0.327317
H  -2.631746 -3.29811 0.277549
H  -5.055297 -2.997666 0.982979
H  -6.006129 -0.654293 1.049942
H  4.744503 2.940503 0.585027
H  3.560888 3.754915 1.640502
H  4.155175 4.603482 0.179024
