program: Gaussian 09
title: 000039055
version: EM64L-G09RevD.01
frameworkgroup: C1[X(C16H17N)]
method: RPBEPBE
basis: SDD
operation: Freq
keyword: #pfreq=noraman
keyword: PBEPBE/SDD
title: #p freq=noraman PBEPBE/SDD
converged: YES YES NO NO
title: Mulliken charges:
elementType: N C C C C C C C C C C C C C C C C H H H H H H H H H H H H H H H H H
charge: -0.333783 -0.309772 -0.114363 0.242378 0.232906 -0.556494 0.497690 -0.754974 -0.366425 -0.377899 -0.382706 -0.459299 -0.251755 -0.256972 -0.239734 -0.230792 -0.249111 0.244575 0.211727 0.266027 0.200416 0.231272 0.208200 0.221130 0.245930 0.249692 0.226757 0.243996 0.236475 0.225331 0.224967 0.223584 0.224180 0.226844
chargesum: 0.00000
title: Mulliken charges with hydrogens summed into heavy atoms:
elementType: N C C C C C C C C C C C C C C C C
charge: -0.067757 -0.065197 0.097363 0.242378 0.232906 -0.124806 0.497690 -0.079713 -0.116733 -0.151141 -0.138710 -0.222824 -0.026423 -0.032005 -0.016149 -0.006612 -0.022267
polarizability: 2.17581418e+02 6.32167223e+00 1.67179556e+02 1.33714044e+01 -2.78083237e+00 1.26751587e+02
1716.lowfreq: -6.7309 -0.0003 0.0003 0.0004 3.5400 9.6313 42.4388 47.2635 67.9322
frequency: 42.2594 47.2332 67.9227 99.6795 155.5527 201.9925 212.1575 239.9840 248.5969 254.2768 319.7831 376.1364 395.6833 405.0565 410.3078 445.5162 468.5396 515.5210 530.2580 557.7066 601.3382 617.1054 641.4536 692.7530 708.2390 712.1041 751.1046 761.3409 786.6178 823.0694 855.7130 865.7850 871.8405 886.6461 922.8035 947.2201 952.4659 976.6488 986.2220 990.5644 994.4085 996.3107 1026.5431 1036.2498 1064.5979 1073.7635 1083.3732 1104.4005 1129.7246 1161.9900 1171.1641 1173.6098 1187.4685 1189.1599 1205.2975 1225.8166 1228.9599 1236.2150 1264.7324 1277.3442 1303.0240 1329.2010 1335.4981 1359.6693 1380.5166 1383.1919 1384.4562 1434.8476 1439.8250 1446.4408 1464.2294 1475.0854 1476.7068 1482.1055 1489.1429 1587.7016 1592.0163 1611.4800 1615.0130 2820.9110 2836.8368 2970.8755 2977.0854 3013.5918 3065.6060 3097.6596 3108.4723 3113.6773 3119.0669 3122.8721 3132.1585 3137.7839 3142.7290 3157.8183 3160.6754 3457.1266
redmass: 3.5029 3.7683 4.4190 3.5624 3.6389 2.3029 1.8287 1.9946 2.7191 3.1556 3.7956 4.4181 3.4900 2.8520 3.1602 2.7351 3.1231 3.5449 3.1962 1.9411 5.2046 6.2276 5.1178 3.2313 1.6714 3.6277 1.3003 2.1636 3.8087 2.7760 1.2507 2.4556 1.4226 2.3890 1.4796 1.4704 1.7482 1.3959 1.3268 4.7920 1.3824 1.8354 2.2004 2.5330 1.9975 2.4482 1.9019 2.3675 1.7566 2.0329 1.0565 1.0794 1.1833 1.9940 1.7400 1.3106 2.3314 1.4998 1.7462 1.4775 1.3292 1.2962 1.4278 1.6213 4.6720 3.3666 1.5493 2.0249 2.1358 1.3999 1.1720 1.0699 1.1279 2.2740 2.1013 6.5751 6.3868 6.1283 6.3432 1.0717 1.0803 1.0828 1.0370 1.0861 1.0988 1.0985 1.0873 1.0866 1.0862 1.0872 1.0912 1.0934 1.0960 1.1006 1.1014 1.0751
irintensity: 0.0887 0.1017 0.1632 0.3416 0.8037 0.7568 0.0782 0.4635 1.8696 7.1863 1.4080 4.1745 10.4574 0.2723 3.7448 4.6317 11.6048 4.5543 14.9061 69.2721 22.8010 3.3198 5.4870 44.9095 55.7270 5.5408 62.8030 33.9646 8.7035 5.4201 0.0848 3.2784 0.1676 1.4616 2.8491 0.5201 0.6775 0.1199 0.0810 0.1653 0.1966 1.3388 6.6926 10.4672 1.8624 7.9525 8.0115 10.3914 2.8412 26.8486 0.1031 0.3055 0.3513 0.4243 3.1464 16.0318 8.6957 1.2483 0.3809 5.2763 15.7702 2.6306 1.8306 10.5851 1.3055 0.4439 24.5452 11.9625 8.6483 1.2902 8.6209 6.4855 13.5379 16.1420 17.5528 3.3428 1.3870 10.5258 0.4580 87.4451 82.6630 17.4851 36.2993 34.8782 33.7357 23.1177 13.4698 7.1606 2.5415 2.7677 15.0745 30.1922 42.3943 34.2252 25.8082 1.3459
temp: 298.150 k
press: 1.00000 atm
elementType: 7 6 6 6 6 6 6 6 6 6 6 6 6 6 6 6 6 1 1 1 1 1 1 1 1 1 1 1 1 1 1 1 1 1
symmnumber: 1
zpe: 748870.8 jmol-1
zpe.correction: 0.285230 hartree
zpe.thermalcorrener: 0.299442 hartree
zpe.thermalcorrenthalpy: 0.300386 hartree
zpe.thermalcorrgfe: 0.243917 hartree
zpe.sumelectzpe: -673.439379 hartree
zpe.sumelectthermal: -673.425167 hartree
zpe.sumelectthermalent: -673.424222 hartree
zpe.sumelectthermalfe: -673.480691 hartree
dipole: -0.1293 0.9493 1.0026
dipole: 1.3867
quadrupole: -92.7717 -94.7877 -99.8618
quadrupole: 3.0021 4.9390 1.6721
quadrupole: 3.0354 1.0194 -4.0547 3.0021 4.9390 1.6721
hfenergy: -673.7246086 hartree
pointgroup: C01 [X(C16H17N1)]
dipole: -0.0665197 0.3439126 0.4182766 debye
polarizability: 216.8445791|6.8623488|167.7333178|14.9412621|0.5058083|126.934664 unknown
InChI: InChI=1S/C16H17N/c1-12-16(13-7-3-2-4-8-13)15-10-6-5-9-14(15)11-17-12/h2-10,12,16-17H,11H2,1H3
charge 0 multiplicity 1
34 atoms
N  1.396566 2.552194 0.104764
C  -0.11631 0.710917 -0.510078
C  0.03923 2.01611 0.3385
C  1.10445 -0.211131 -0.334699
C  2.32971 0.271653 0.200377
C  2.466083 1.714368 0.671449
C  -1.445396 0.017497 -0.209999
C  -1.004128 3.080952 -0.036949
C  1.032987 -1.564144 -0.759598
C  3.438201 -0.603416 0.314962
C  -1.669439 -0.616871 1.041125
C  -2.499474 0.027493 -1.157417
C  2.141544 -2.428283 -0.650657
C  3.35497 -1.946597 -0.105718
C  -2.912319 -1.217367 1.336415
C  -3.745618 -0.575998 -0.868683
C  -3.957461 -1.199127 0.382094
H  -0.127878 1.042002 -1.569431
H  -0.109454 1.735952 1.414206
H  1.479218 3.541303 0.370674
H  2.467742 1.714595 1.793738
H  3.445894 2.116112 0.350784
H  -0.895227 3.979887 0.599822
H  -0.873612 3.387417 -1.091447
H  -2.028407 2.694635 0.094231
H  0.090311 -1.941246 -1.172747
H  4.379732 -0.221176 0.73065
H  -0.857108 -0.656508 1.776774
H  -2.34074 0.510281 -2.130055
H  2.06149 -3.468088 -0.987139
H  4.224281 -2.607759 -0.016409
H  -3.066656 -1.703476 2.306736
H  -4.546271 -0.560586 -1.617073
H  -4.921309 -1.668499 0.6094
