program: Gaussian 09
title: 000037464
version: EM64L-G09RevD.01
frameworkgroup: C1[X(C18H29NO2)]
method: RPBEPBE
basis: SDD
operation: Freq
keyword: #p
keyword: freq=noraman
keyword: PBEPBE/SDD
title: #p freq=noraman PBEPBE/SDD
converged: YES YES NO NO
title: Mulliken charges:
elementType: O O N C C C C C C C C C C C C C C C C C C H H H H H H H H H H H H H H H H H H H H H H H H H H H H H
charge: -0.296545 -0.448888 -0.346503 -0.140264 -0.476416 -0.487548 -0.449615 -0.414028 0.307919 0.218530 -0.385366 0.260671 -0.088936 -0.428785 -0.316291 -0.367500 -0.267673 -0.699251 -0.686534 -0.725985 -0.244802 0.240614 0.234743 0.183475 0.222166 0.216673 0.214604 0.206292 0.207266 0.212337 0.228994 0.196056 0.231998 0.195625 0.239686 0.214638 0.276561 0.247259 0.222070 0.218797 0.210881 0.218495 0.207068 0.229390 0.200832 0.207494 0.208275 0.231608 0.222726 0.337184
chargesum: 0.00000
title: Mulliken charges with hydrogens summed into heavy atoms:
elementType: O O N C C C C C C C C C C C C C C C C C C
charge: -0.296545 -0.111704 -0.069942 0.100350 -0.058198 -0.048708 -0.028719 0.005575 0.307919 0.218530 -0.156372 0.260671 0.107120 -0.001162 0.138033 -0.120241 -0.045603 -0.051078 -0.049244 -0.078607 -0.022076
polarizability: 2.38777160e+02 -5.05828818e+00 2.16426387e+02 -1.73130999e+01 1.20638442e+01 1.67650718e+02
1716.lowfreq: -14.8847 -3.1231 0.0002 0.0006 0.0009 4.8657 13.7162 22.2581 33.1377
frequency: 2.5311 19.9213 32.8533 44.2591 56.3846 64.3410 72.9624 84.3638 100.8972 137.7132 144.8671 156.1200 173.4506 204.1609 211.3123 236.5154 239.9523 244.7020 246.0145 257.0649 291.2057 303.9444 322.9583 330.8114 369.5465 407.6923 423.9582 440.9642 473.1016 476.3450 500.9828 509.8781 540.2243 559.1868 606.1395 621.2774 640.9446 684.4859 734.0994 741.0790 754.1668 763.1702 792.5218 807.3067 833.0138 841.6398 852.4595 885.1963 887.1807 903.6723 913.3418 920.9508 923.3318 931.6901 937.1126 958.5477 963.9594 964.9873 972.0516 977.2338 1010.6160 1019.8821 1044.2689 1047.2226 1061.7198 1066.8173 1078.4928 1090.6575 1110.3815 1116.9305 1162.4871 1173.5314 1179.1028 1182.8783 1190.9743 1197.0817 1210.0495 1217.5012 1224.3809 1238.6386 1241.8715 1244.6804 1261.8225 1273.7681 1285.4680 1289.7737 1292.7783 1294.3440 1297.8409 1307.2229 1343.7869 1351.6796 1367.4927 1371.0345 1378.3661 1389.9853 1393.3503 1406.3879 1435.6375 1445.9297 1451.9350 1456.4476 1459.1574 1462.4610 1464.1930 1470.3564 1471.8883 1474.6570 1479.2055 1485.2835 1486.8876 1490.7725 1493.6727 1591.3715 1605.3832 2941.7989 2956.0161 2966.6928 2972.0361 2978.6589 2979.9908 2983.5764 2985.6383 2990.6304 2995.2652 3008.4351 3028.0012 3039.3508 3048.1196 3056.9645 3061.6152 3062.2694 3064.6113 3069.1924 3072.4173 3077.7472 3087.5679 3093.9521 3126.7069 3140.7424 3156.8569 3169.4705 3418.5862 3561.5196
redmass: 2.8617 4.2496 3.6685 2.2918 3.9628 2.2131 3.4492 3.6008 3.5789 3.1687 3.3057 1.2137 3.4085 3.9433 1.6599 1.3996 1.2308 1.3534 1.6560 2.0946 4.0792 3.1825 3.5149 2.4343 2.6158 2.6292 2.8122 2.4230 2.8447 2.9392 3.1257 2.8655 3.8491 3.4707 2.9706 4.2967 4.1575 1.6106 2.4351 2.8236 1.4296 1.3908 3.3125 2.3500 2.4479 2.4620 1.6560 2.0280 2.6408 1.9248 2.5761 1.7229 2.1122 1.6164 1.2146 1.9139 2.4812 1.5251 1.3469 1.4249 1.4792 1.4897 1.9249 2.2144 2.4999 2.2194 2.9704 2.2662 2.3918 3.1364 1.3344 1.1029 1.4046 1.5782 1.3381 1.8739 2.5162 1.4784 1.5770 2.1512 1.7788 1.1910 1.2576 1.6526 1.3733 1.3777 1.3862 1.2949 1.3023 1.3244 1.7405 1.4146 1.2134 1.2448 1.3800 3.0418 1.2925 1.6969 2.1418 1.1290 1.1018 1.1561 1.0614 1.0547 1.0765 1.0788 1.0886 1.0841 1.0921 1.1867 1.5504 1.2393 1.0861 6.7786 6.4010 1.0673 1.0766 1.0351 1.0365 1.0768 1.0365 1.0594 1.0617 1.0638 1.0636 1.0664 1.0956 1.1002 1.1068 1.1001 1.1019 1.1000 1.0994 1.0986 1.0978 1.1044 1.1006 1.0997 1.0847 1.0898 1.0943 1.0982 1.0740 1.0660
irintensity: 0.0217 0.0895 0.2480 0.0161 1.4167 0.0598 1.1854 0.1763 1.5458 2.8617 1.1014 1.1942 0.8060 2.6004 0.7053 73.0979 8.7647 6.0965 31.7675 27.5804 5.8977 2.9161 0.7798 1.2959 4.7235 6.1064 10.4277 5.2595 4.1556 1.9469 9.8925 7.2851 5.8759 0.1938 0.5264 3.6131 11.0354 72.8272 7.4951 6.7804 79.6979 2.0147 15.4017 5.6939 10.8950 11.9768 0.3245 5.7169 5.3813 3.6910 7.3587 9.6180 16.4844 20.2252 0.3000 22.0027 38.0572 0.4643 0.3370 1.3292 2.0491 4.4249 4.8313 19.8595 2.0633 38.9049 15.0339 14.9059 25.3739 38.5091 17.5262 3.3047 1.6826 11.6461 33.8320 52.0565 52.9777 47.3878 79.9505 56.1027 41.1112 16.6658 1.1236 15.2523 3.2536 2.2088 4.5722 2.1648 0.4190 1.3226 4.1217 6.4849 25.2859 25.7914 4.7657 5.6628 20.3939 4.4449 44.1100 13.4579 8.9011 40.6616 8.8948 0.7901 0.3925 4.7455 7.9818 11.2962 17.3571 31.0225 17.5351 15.6050 12.3612 8.0057 24.6835 16.3277 39.6862 30.1848 35.8678 4.8062 14.8698 62.5206 10.4758 38.7994 68.2888 42.7619 59.2871 20.8589 24.0079 14.9386 22.0529 14.5121 3.3239 69.0126 95.3296 102.2596 3.8754 63.7986 0.1772 18.7234 37.9473 15.3040 0.2560 6.4260
temp: 298.150 k
press: 1.00000 atm
elementType: 8 8 7 6 6 6 6 6 6 6 6 6 6 6 6 6 6 6 6 6 6 1 1 1 1 1 1 1 1 1 1 1 1 1 1 1 1 1 1 1 1 1 1 1 1 1 1 1 1 1
symmnumber: 1
zpe: 1143795.6 jmol-1
zpe.correction: 0.435649 hartree
zpe.thermalcorrener: 0.458859 hartree
zpe.thermalcorrenthalpy: 0.459803 hartree
zpe.thermalcorrgfe: 0.379390 hartree
zpe.sumelectzpe: -906.837585 hartree
zpe.sumelectthermal: -906.814375 hartree
zpe.sumelectthermalent: -906.813430 hartree
zpe.sumelectthermalfe: -906.893844 hartree
dipole: -2.1926 0.6303 -0.4113
dipole: 2.3182
quadrupole: -121.4695 -124.7584 -130.6256
quadrupole: 2.2682 -7.2529 2.8661
quadrupole: 4.1483 0.8595 -5.0078 2.2682 -7.2529 2.8661
hfenergy: -907.2732337 hartree
pointgroup: C01 [X(C18H29N1O2)]
dipole: -0.7861773 0.2944043 -0.3564586 debye
polarizability: 231.0484361|-19.7333874|216.0408541|-10.4293103|-21.8711848|175.7649747 unknown
InChI: InChI=1S/C18H29NO2/c1-18(2,3)19-12-15(20)13-21-17-11-7-6-10-16(17)14-8-4-5-9-14/h6-7,10-11,14-15,19-20H,4-5,8-9,12-13H2,1-3H3
charge 0 multiplicity 1
50 atoms
O  0.014929 -0.619277 1.241516
O  -1.621989 0.596213 3.514655
N  -2.736637 0.058984 -0.065208
C  2.044223 0.715883 -0.109602
C  3.322566 1.525901 -0.439505
C  1.194321 0.903201 -1.408652
C  2.762477 2.819245 -1.087036
C  1.494606 2.359689 -1.88682
C  2.217888 -0.738809 0.302584
C  1.154531 -1.407331 0.984811
C  3.384221 -1.488261 0.026421
C  -3.557489 0.734179 -1.123162
C  -2.117632 -0.141627 2.336036
C  -2.388499 0.819178 1.153314
C  -1.073246 -1.216822 2.032289
C  1.260225 -2.766069 1.364928
C  3.505466 -2.849031 0.398004
C  -2.950858 2.097312 -1.57453
C  -4.999482 0.9477 -0.596673
C  -3.5951 -0.239693 -2.326158
C  2.440044 -3.485509 1.066323
H  1.508406 1.237053 0.709395
H  3.949661 1.719435 0.449324
H  3.943422 0.982256 -1.178733
H  1.52595 0.166292 -2.16489
H  0.121114 0.725691 -1.219571
H  2.473621 3.536421 -0.295583
H  3.505852 3.325221 -1.728762
H  1.676613 2.385294 -2.976617
H  0.640019 3.032674 -1.688599
H  4.222617 -0.999253 -0.480646
H  -3.06249 -0.672971 2.584563
H  -1.497331 1.474303 1.040904
H  -3.245281 1.464419 1.427451
H  -0.680959 -1.610371 2.989518
H  -1.542176 -2.036286 1.453101
H  -1.882981 -0.347082 -0.475989
H  0.440643 -3.270161 1.884763
H  4.424407 -3.39997 0.170767
H  -2.881632 2.802122 -0.725287
H  -3.575815 2.570223 -2.355083
H  -1.934025 1.955259 -1.987369
H  -5.643818 1.356662 -1.396195
H  -5.421918 -0.013354 -0.254797
H  -5.030763 1.660719 0.248169
H  -2.576627 -0.414955 -2.725054
H  -4.211551 0.172069 -3.144918
H  -4.017954 -1.212351 -2.018284
H  2.519453 -4.53789 1.361225
H  -2.240024 1.345375 3.710562
