program: Gaussian 09
title: 000039056
version: EM64L-G09RevD.01
frameworkgroup: C1[X(C19H21NO2)]
method: RPBEPBE
basis: SDD
operation: Freq
keyword: #p
keyword: freq=noraman
keyword: PBEPBE/SDD
title: #p freq=noraman PBEPBE/SDD
converged: YES YES NO NO
title: Mulliken charges:
elementType: O O N C C C C C C C C C C C C C C C C C C C H H H H H H H H H H H H H H H H H H H H H
charge: -0.317687 -0.297995 -0.178012 -0.378685 -0.136066 0.336529 -0.523992 0.226446 0.484678 -0.719308 -0.417145 -0.366135 0.306459 -0.440780 -0.364370 -0.247238 -0.249957 -0.227871 -0.237255 -0.244306 -0.205912 -0.677416 0.216058 0.283363 0.236441 0.271022 0.233652 0.234111 0.217885 0.242433 0.232531 0.226644 0.239088 0.228303 0.227823 0.223002 0.222229 0.225922 0.226649 0.225098 0.210980 0.226371 0.226416
chargesum: 0.00000
title: Mulliken charges with hydrogens summed into heavy atoms:
elementType: O O N C C C C C C C C C C C C C C C C C C C
charge: -0.317687 -0.297995 -0.178012 -0.162628 0.147297 0.336529 -0.016529 0.226446 0.484678 -0.033660 -0.174712 -0.133604 0.306459 -0.214136 -0.125282 -0.018935 -0.022135 -0.004869 -0.015026 -0.018384 0.245835 -0.013650
polarizability: 2.17051098e+02 9.16586884e+00 2.32552693e+02 -6.43726892e+00 1.61905376e+01 1.79351317e+02
1716.lowfreq: -8.0491 -3.5352 -0.0007 -0.0006 -0.0006 6.9827 19.2354 20.7888 37.7173
frequency: 18.8526 20.5719 37.6335 45.0062 62.9674 83.3571 92.1907 112.2252 117.5607 150.4892 186.0521 202.9602 217.7954 224.6274 247.5951 255.7412 264.2811 289.9010 312.7862 352.7194 371.4288 404.1864 433.0560 437.9938 477.1847 495.6913 520.7339 566.7994 597.6580 604.6509 617.6730 646.7883 693.2054 705.0024 715.4956 726.6925 743.0344 765.1671 766.6752 801.1796 810.6824 830.7923 835.3297 852.6477 870.9181 879.0636 910.2510 935.6906 949.4505 974.2352 976.1219 988.1059 990.7714 993.9994 997.3461 1015.7878 1027.6014 1037.2495 1048.5491 1081.1574 1092.8587 1099.2432 1111.1814 1123.2691 1139.2814 1171.4352 1173.7578 1179.1509 1187.8801 1190.0856 1208.3116 1218.5858 1233.4562 1246.2798 1248.5272 1264.4550 1298.4939 1304.3012 1326.4739 1345.1131 1346.5497 1364.3058 1382.3937 1384.4145 1390.9877 1397.7135 1410.4434 1437.9391 1443.4287 1463.0060 1469.8757 1471.2793 1476.6365 1480.6361 1482.2272 1491.1500 1492.1668 1591.8594 1595.8903 1611.7960 1616.7910 1636.7117 2933.5021 2983.7887 2989.6226 2993.1565 3009.3543 3053.0031 3053.9645 3066.1678 3082.0364 3089.6897 3089.8980 3103.9613 3108.6291 3110.7564 3119.0793 3122.4396 3135.2448 3138.4685 3146.5833 3160.3004 3161.7849
redmass: 3.8132 4.4396 2.7473 3.3253 4.3958 4.0183 4.1336 3.4537 3.5174 3.4068 2.9884 1.4562 1.7450 3.7959 1.2613 3.8164 3.9811 4.8659 4.2435 5.1605 4.1778 2.8211 4.3222 2.8566 3.8911 3.6349 4.0539 3.5882 5.7737 5.6342 6.0207 5.5124 9.7798 1.7596 3.9313 3.0974 2.2733 2.4440 1.7892 1.0950 3.3324 3.2349 3.2413 1.2536 1.4440 3.4112 1.7586 1.8117 1.5037 2.0729 1.3915 1.3349 6.0768 1.3430 2.0330 2.1109 2.2250 2.3128 3.4782 1.7053 2.0763 2.5603 2.1765 1.8503 1.4616 1.0572 1.1098 2.3280 2.5068 1.1178 2.0870 1.3491 2.6382 1.5213 1.1601 1.5774 1.8267 1.9072 1.2744 1.4608 1.4138 1.4741 3.2936 1.4629 4.4530 1.2961 2.0169 2.2229 2.3373 1.0413 1.0854 1.0501 1.0514 1.2909 2.1157 1.1185 1.7571 6.2835 6.5501 6.1301 6.4036 11.2959 1.0715 1.0379 1.0804 1.0356 1.0582 1.0866 1.0885 1.1065 1.0982 1.0999 1.0984 1.1027 1.0877 1.0876 1.0885 1.0856 1.0911 1.0928 1.0954 1.1004 1.1014
irintensity: 0.0165 0.0736 0.4581 0.0449 0.8107 3.4905 1.6861 0.9971 1.9713 1.3766 1.6871 0.4824 2.6181 1.2628 0.3440 3.2699 1.7116 5.7154 0.2683 14.2018 0.4119 0.1244 1.5800 9.5182 3.8636 2.0829 2.9741 16.2229 6.4501 2.1844 1.8011 2.8548 16.5859 42.7238 3.8131 32.4632 50.5172 11.9312 38.6253 2.7809 11.7707 4.3027 1.5729 0.1524 0.5187 1.8602 6.1542 7.9923 1.1816 13.5061 0.1449 0.7518 0.6828 1.9544 50.1692 10.0356 7.7080 5.9380 253.2882 8.7051 16.6544 9.7471 2.8699 37.2465 4.8430 0.0941 2.2405 17.9900 2.7991 2.9160 28.3065 209.9614 16.4802 10.3444 0.7541 2.5242 71.7192 130.7805 3.1397 8.5607 3.2938 6.6394 3.2917 14.3421 4.7851 40.6945 84.7116 18.7364 3.3066 12.6755 20.1949 11.7143 5.9760 8.7742 20.2127 14.1709 3.4188 2.3778 4.3629 8.0031 2.4883 373.4034 37.5399 16.7251 31.0949 21.8487 25.9984 1.3811 6.7711 6.7775 28.9066 17.0932 40.2799 47.3259 10.5308 11.5122 2.7739 0.1722 17.6874 23.4717 40.5889 35.5724 23.0006
temp: 298.150 k
press: 1.00000 atm
elementType: 8 8 7 6 6 6 6 6 6 6 6 6 6 6 6 6 6 6 6 6 6 6 1 1 1 1 1 1 1 1 1 1 1 1 1 1 1 1 1 1 1 1 1
symmnumber: 1
zpe: 930952.7 jmol-1
zpe.correction: 0.354581 hartree
zpe.thermalcorrener: 0.374969 hartree
zpe.thermalcorrenthalpy: 0.375913 hartree
zpe.thermalcorrgfe: 0.303314 hartree
zpe.sumelectzpe: -940.247551 hartree
zpe.sumelectthermal: -940.227163 hartree
zpe.sumelectthermalent: -940.226219 hartree
zpe.sumelectthermalfe: -940.298818 hartree
dipole: -0.7398 -1.8250 -0.9649
dipole: 2.1930
quadrupole: -122.2275 -122.7217 -125.4508
quadrupole: -4.6231 -8.8951 0.7223
quadrupole: 1.2392 0.7450 -1.9841 -4.6231 -8.8951 0.7223
hfenergy: -940.6021317 hartree
pointgroup: C01 [X(C19H21N1O2)]
dipole: -0.1236877 0.787075 0.3310754 debye
polarizability: 212.3674971|-4.3885247|237.3510967|12.3318741|10.7262699|179.2365134 unknown
InChI: InChI=1S/C19H21NO2/c1-3-22-19(21)20-13-16-11-7-8-12-17(16)18(14(20)2)15-9-5-4-6-10-15/h4-12,14,18H,3,13H2,1-2H3
charge 0 multiplicity 1
43 atoms
O  3.222138 0.042173 0.428149
O  2.581857 -1.573218 -1.155882
N  1.255299 0.324283 -0.737968
C  -1.166489 -0.038501 -1.121999
C  0.257159 -0.051411 -1.768394
C  -1.417388 1.288274 -0.407857
C  1.114506 1.629222 -0.067159
C  -0.338615 2.063365 0.089502
C  -1.375045 -1.263875 -0.220089
C  0.351182 0.86519 -3.010154
C  -2.743869 1.75551 -0.224771
C  -0.604755 3.290648 0.748051
C  2.353418 -0.491151 -0.548986
C  -1.854763 -2.471765 -0.789474
C  -1.061184 -1.245149 1.161943
C  -3.00555 2.971246 0.437838
C  -1.926135 3.74622 0.92757
C  -2.011959 -3.633971 -0.00315
C  -1.215103 -2.406636 1.95195
C  -1.689911 -3.605796 1.373579
C  4.41426 -0.801399 0.72213
C  5.218553 -0.063987 1.788774
H  -1.888573 -0.120144 -1.959458
H  0.508155 -1.083927 -2.064173
H  1.669134 2.412832 -0.628505
H  1.599683 1.558659 0.920992
H  0.095626 1.912799 -2.770279
H  1.373247 0.837797 -3.426852
H  -0.346591 0.517374 -3.793546
H  -3.575874 1.149947 -0.604991
H  0.233597 3.890347 1.125681
H  -2.10678 -2.501761 -1.857774
H  -0.710038 -0.316211 1.624357
H  -4.037048 3.315556 0.570748
H  -2.115521 4.694555 1.442562
H  -2.385059 -4.557341 -0.460787
H  -0.96703 -2.374851 3.019188
H  -1.811091 -4.505569 1.987281
H  4.068662 -1.793437 1.064874
H  4.985104 -0.943181 -0.213375
H  6.121888 -0.647345 2.045026
H  5.537346 0.928686 1.426594
H  4.622757 0.074145 2.707533
