program: Gaussian 09
title: 000035231
version: EM64L-G09RevD.01
frameworkgroup: C1[X(C6H11N5)]
method: RPBEPBE
basis: SDD
operation: Freq
keyword: #pfreq=noraman
keyword: PBEPBE/SDD
title: #p freq=noraman PBEPBE/SDD
converged: NO YES NO NO
title: Mulliken charges:
elementType: N N N N N C C C C C C H H H H H H H H H H H
charge: -0.334885 -0.102485 -0.125230 -0.108651 -0.587402 -0.303169 0.066365 -0.718163 0.097700 0.022565 -0.745208 0.232753 0.233539 0.323272 0.221509 0.220688 0.229961 0.239269 0.237010 0.238996 0.328706 0.332858
chargesum: 0.00000
title: Mulliken charges with hydrogens summed into heavy atoms:
elementType: N N N N N C C C C C C
charge: -0.011613 -0.102485 -0.125230 -0.108651 0.074163 0.163123 0.066365 -0.046004 0.097700 0.022565 -0.029933
polarizability: 1.44308153e+02 -5.07145030e+00 1.11799982e+02 1.05373047e-01 5.13542384e-01 5.73362819e+01
1716.lowfreq: -44.5560 -14.9297 -5.3669 -1.9849 -0.0009 -0.0006 -0.0005 13.6312 93.5615
frequency: -44.3288 -11.7644 93.5450 118.6771 176.8761 183.7047 208.0165 267.9898 281.3655 328.6352 356.9885 476.6209 501.1506 530.2732 549.2838 550.4146 580.1331 611.1833 691.0987 718.5262 792.5271 801.5490 888.9690 897.7729 941.6545 986.9852 1051.4099 1057.9727 1067.4361 1099.0993 1145.0104 1176.6840 1239.2924 1259.3253 1316.2259 1356.9779 1385.0489 1396.2627 1409.2828 1417.1635 1454.7538 1464.4718 1478.2169 1480.8966 1492.0763 1500.6879 1522.3302 1560.3587 1615.9696 2983.3552 2991.6888 2995.7187 3032.4147 3079.2805 3086.1497 3093.3509 3132.1239 3556.2525 3563.9997 3717.4305
redmass: 1.0169 2.1489 2.8264 3.4896 6.3778 4.1904 3.0276 1.3658 2.6469 2.9517 3.5351 1.2069 3.3478 1.1269 1.1935 3.9608 5.6560 3.5501 4.8282 10.9779 1.1845 6.0611 2.3076 10.7157 1.9232 3.3096 1.6414 2.7689 2.2944 2.3790 1.5206 2.8451 6.5046 1.1010 1.8120 1.9358 1.2968 1.2453 2.6986 2.8495 1.1275 1.2062 1.0406 1.0814 2.0656 1.3702 2.8274 3.4401 2.0527 1.0370 1.0590 1.0402 1.1036 1.1013 1.0918 1.0984 1.1019 1.0442 1.0769 1.1058
irintensity: 0.1402 0.1277 6.5457 1.2975 1.1114 6.6033 2.8895 0.1634 2.1323 5.4380 6.5138 258.3860 5.2301 126.4327 9.3472 6.6622 3.4270 14.3486 2.6205 0.1986 11.1345 18.9368 3.0551 4.1888 1.6601 5.5974 11.5386 5.7127 0.0508 3.2680 1.9054 12.3342 9.2915 0.1037 47.3936 11.8737 1.9785 42.2242 42.0218 117.0383 15.1947 118.9782 12.9544 48.4965 296.7446 66.1059 312.2468 922.8779 226.8590 32.0242 27.3545 8.8365 10.3195 54.1320 16.2344 32.6766 11.2758 99.1850 51.2031 46.6745
temp: 298.150 k
press: 1.00000 atm
elementType: 7 7 7 7 7 6 6 6 6 6 6 1 1 1 1 1 1 1 1 1 1 1
symmnumber: 1
zpe: 470806.2 jmol-1
zpe.correction: 0.179321 hartree
zpe.thermalcorrener: 0.189198 hartree
zpe.thermalcorrenthalpy: 0.190142 hartree
zpe.thermalcorrgfe: 0.144180 hartree
zpe.sumelectzpe: -508.190575 hartree
zpe.sumelectthermal: -508.180697 hartree
zpe.sumelectthermalent: -508.179753 hartree
zpe.sumelectthermalfe: -508.225715 hartree
dipole: -1.1959 -1.6068 0.0913
dipole: 2.0051
quadrupole: -53.1486 -58.7678 -67.5098
quadrupole: -3.9466 0.1258 0.1402
quadrupole: 6.6601 1.0409 -7.7011 -3.9466 0.1258 0.1402
hfenergy: -508.3698952 hartree
pointgroup: C01 [X(C6H11N5)]
dipole: 0.4644766 0.636541 0.0371731 debye
dipolederiv: -1.7191527 -0.0213622 -0.0019545 -0.3009966 -0.2934159 0.0026585 -0.0013679 0.0018878 -0.4753052 -1.2812379 -0.1763521 0.0071322 -0.6620756 -0.8479187 -0.0021453 -0.0121347 -0.0011612 -0.1881851 -1.599288 0.3058779 -0.000818 0.3086792 -0.6639356 0.0004706 -0.0045042 -0.0060388 -0.2622037 -0.8020415 0.0710594 -0.008885 0.3994825 -1.3315571 0.0040685 0.0043784 -0.0049685 -0.2128715 -0.889241 0.6442912 0.0030403 0.7624493 -0.9028683 0.0029001 0.005313 -0.0001804 -0.7208904 0.6658012 -0.1485751 0.0007943 -0.3680959 0.3097724 -0.0031604 -0.0015611 -0.0032852 0.3110616 2.1976332 0.0307384 0.0036179 0.4161591 0.7704336 0.0011235 0.0181526 0.0124014 0.2147121 -0.1027045 -0.0153099 0.0010813 0.0279552 0.0484055 0.0010984 0.0007083 0.0015977 0.096063 1.2366082 0.0121392 -0.0068756 0.06179 1.1546478 -0.0257827 -0.0256487 -0.0722328 0.0468182 1.5821876 -0.5817364 0.0000488 -0.6890412 1.4378863 0.0023987 -0.0005776 0.0171868 0.2120421 -0.012037 -0.1560141 0.0093803 -0.1411948 -0.3276706 0.0243796 0.0514321 0.1343594 0.0039561 -0.0247106 -0.0174971 0.0341059 0.0918419 -0.018281 0.0897518 -0.017981 0.1096846 -0.0660647 -0.0206769 -0.0192714 -0.035687 0.0880034 -0.0169965 -0.0885258 0.0163348 -0.1074604 -0.0624237 0.1816615 0.0204449 -0.0010322 0.0834505 0.1390239 -0.0016361 -0.0014942 -0.0023756 0.3105864 0.0902093 -0.0064522 -0.0063471 -0.07952 -0.0020158 0.1197341 0.0408246 0.1244271 -0.0774523 0.0888494 -0.0073428 0.0051298 -0.081222 -0.0037109 -0.1197841 -0.0421169 -0.1252708 -0.0766072 -0.0818293 0.0945363 0.0004869 0.1521538 -0.0204935 -0.0004435 0.0001196 -0.0002449 0.1142337 -0.0000909 0.1140855 0.0713835 0.045617 0.0226654 -0.0435495 0.0416446 -0.0834917 0.0852039 0.1031374 -0.0201963 0.0308364 -0.025352 0.0459768 0.0348806 0.0393834 0.0612841 -0.0842925 -0.0422785 -0.0366975 -0.1042204 0.0126286 0.0795839 0.0055869 -0.1089605 -0.0529513 0.0604243 0.1727974 -0.0291878 -0.0006029 -0.0657253 0.234504 -0.0018524 -0.0011902 -0.0015292 0.3858434 0.2564035 -0.0571779 -0.0006148 -0.0369872 0.1859646 -0.0021715 -0.0007545 -0.0016381 0.3853515 unknown
polarizability: 144.4013528|-4.7623902|111.7083547|-0.0628606|-0.4314487|57.334709 unknown
InChI: InChI=1S/C6H11N5/c1-3-8-6-10-4(2)9-5(7)11-6/h8H,3,7H2,1-2H3
charge 0 multiplicity 1
22 atoms
N  1.844892 0.616931 0.005847
N  0.145249 -1.01387 -0.014098
N  -0.361988 1.385377 0.002562
N  -2.167801 -0.268728 -0.017147
N  -2.614757 2.032388 0.001347
C  2.91168 -0.398085 0.002062
C  0.509489 0.319509 -0.001625
C  4.291041 0.280743 -0.007247
C  -1.204758 -1.238865 -0.019324
C  -1.681693 1.02661 -0.004489
C  -1.669749 -2.672583 -0.003153
H  2.802416 -1.050312 0.889256
H  2.791076 -1.052943 -0.881377
H  2.083955 1.609693 0.01626
H  4.422654 0.910012 -0.906822
H  4.432952 0.914472 0.88774
H  5.088121 -0.482486 -0.0096
H  -0.890926 -3.331375 -0.416745
H  -1.870306 -2.989893 1.037768
H  -2.609731 -2.77589 -0.568056
H  -2.305852 3.000704 0.010434
H  -3.600465 1.78419 -0.003792
