program: Gaussian 09
title: 000035216
version: EM64L-G09RevD.01
frameworkgroup: C1[X(C17H14BrN3)]
method: RPBEPBE
basis: SDD
operation: Freq
keyword: #p
keyword: freq=noraman
keyword: PBEPBE/SDD
title: #p freq=noraman PBEPBE/SDD
converged: YES YES NO NO
title: Mulliken charges:
elementType: Br N N N C C C C C C C C C C C C C C C C C H H H H H H H H H H H H H H
charge: -0.027061 -0.025608 -0.029741 -0.053287 0.104974 -0.566537 -0.050787 -0.062948 0.289659 0.290575 -0.642456 -0.348429 -0.342580 -0.348789 -0.342979 -0.229954 -0.231778 -0.229471 -0.231599 -0.225790 -0.225570 0.318982 0.264763 0.224933 0.243505 0.268242 0.273699 0.268219 0.277460 0.230788 0.231831 0.230799 0.231952 0.232501 0.232482
chargesum: 0.00000
title: Mulliken charges with hydrogens summed into heavy atoms:
elementType: Br N N N C C C C C C C C C C C C C C C C C
charge: -0.027061 -0.025608 -0.029741 -0.053287 0.104974 -0.247555 -0.050787 -0.062948 0.289659 0.290575 0.090744 -0.080187 -0.068881 -0.080571 -0.065519 0.000834 0.000053 0.001329 0.000353 0.006712 0.006912
polarizability: 3.35655444e+02 -1.65827587e+01 2.74843829e+02 -2.88448699e+00 -1.10947116e+01 1.18634882e+02
1716.lowfreq: -7.5264 -2.1449 -0.0008 -0.0008 -0.0003 3.4842 17.2233 29.2189 35.8016
frequency: 17.0379 29.1136 35.7348 45.0782 70.0330 91.0701 100.8016 107.1109 190.8722 206.3782 210.8312 227.8347 235.0802 252.0890 262.9384 319.2332 371.4753 403.0758 404.2688 424.9896 442.1164 471.7532 508.5277 569.6016 612.9500 613.8534 625.3952 630.5901 669.0671 680.8407 694.8392 705.7749 712.5833 781.8983 807.3917 819.4431 858.0786 864.7570 866.8295 869.5053 918.8136 958.7805 960.7102 979.0829 989.4416 990.6844 999.1033 1001.0656 1010.8908 1011.8132 1020.0045 1020.3734 1044.7494 1070.2504 1075.6006 1081.1826 1105.5508 1128.3265 1164.6868 1172.6240 1173.0469 1176.9210 1182.1612 1206.5603 1260.9987 1301.4570 1311.5515 1330.2968 1351.8056 1389.7455 1391.3865 1392.4523 1408.3650 1425.8219 1436.0857 1456.2404 1458.3319 1466.4767 1469.7337 1484.3119 1495.9200 1586.7390 1588.3505 1611.4890 1612.6734 2986.5171 3084.9791 3104.4429 3129.4873 3129.6187 3130.7748 3142.5294 3142.7120 3156.9300 3157.1194 3169.6572 3170.1477 3175.8495 3176.3060
redmass: 7.4586 3.7654 3.9745 8.2678 5.3966 7.9432 4.8945 4.6301 6.8988 6.0298 5.1593 4.6423 1.1435 3.2798 4.9681 5.2556 5.7607 2.8415 2.8562 6.0500 3.6655 3.8436 4.8442 5.6634 6.4649 6.1792 5.4052 7.8150 5.7360 4.7005 2.9297 1.5060 2.1757 2.2577 2.4070 7.3837 6.4346 1.2463 1.2453 4.3486 13.0131 1.4461 1.4486 1.5809 6.2337 6.1300 1.3821 1.3787 1.3374 1.3371 2.5254 2.2772 1.5614 2.2420 1.6509 1.9137 2.5722 3.2651 4.3799 1.0629 1.0584 1.1372 1.1268 1.4413 2.1735 1.7845 1.3627 2.3772 2.9232 1.4216 5.7993 7.8746 3.3159 3.4908 2.4579 1.5074 1.6687 2.2809 1.6586 2.6619 3.2757 6.3571 6.4174 6.1414 6.1968 1.0406 1.0924 1.0896 1.0855 1.0855 1.0995 1.0896 1.0896 1.0944 1.0944 1.0948 1.0947 1.0991 1.0990
irintensity: 0.4515 0.0157 0.0590 1.2471 0.5372 0.6833 0.4277 0.6047 0.1634 0.1315 0.4066 0.0284 0.7406 2.0916 0.5889 2.4128 1.7215 0.0015 0.0062 7.8227 0.0339 12.7181 1.1327 31.4176 1.0231 0.1003 6.7730 29.9364 1.1454 0.0179 22.9504 0.3329 130.9521 78.6683 0.0314 4.4547 1.9908 0.0508 0.0335 6.2860 4.8205 0.1350 6.7807 18.9729 2.8263 0.6097 0.1389 0.0776 0.1081 0.7788 2.3990 24.3283 47.8810 6.1470 6.9492 9.6703 4.3189 7.3296 18.4764 2.8202 0.3525 62.9617 9.3758 18.6118 9.3204 8.2868 0.4120 27.8182 269.9166 29.2112 70.0335 26.7167 48.0447 151.0291 84.8159 123.5127 153.0050 513.7712 346.0870 65.5749 10.0223 1.2407 0.3532 31.1981 13.5640 13.7648 16.4712 2.0708 0.0537 0.0104 12.9459 9.4924 17.6496 40.0246 8.9505 5.3377 12.9765 33.6240 12.2446
temp: 298.150 k
press: 1.00000 atm
elementType: 35 7 7 7 6 6 6 6 6 6 6 6 6 6 6 6 6 6 6 6 6 1 1 1 1 1 1 1 1 1 1 1 1 1 1
symmnumber: 1
zpe: 701852.5 jmol-1
zpe.correction: 0.267321 hartree
zpe.thermalcorrener: 0.285374 hartree
zpe.thermalcorrenthalpy: 0.286318 hartree
zpe.thermalcorrgfe: 0.217536 hartree
zpe.sumelectzpe: -832.487127 hartree
zpe.sumelectthermal: -832.469074 hartree
zpe.sumelectthermalent: -832.468130 hartree
zpe.sumelectthermalfe: -832.536912 hartree
dipole: 0.6914 2.3922 1.6782
dipole: 3.0028
quadrupole: -109.1686 -120.9667 -134.4687
quadrupole: -3.6532 -2.8633 -9.0399
quadrupole: 12.3661 0.5680 -12.9341 -3.6532 -2.8633 -9.0399
hfenergy: -832.7544485 hartree
pointgroup: C01 [X(C17H14Br1N3)]
dipole: 0.0414827 0.8410869 0.8285655 debye
polarizability: 339.84899|0.1966357|269.6217058|-2.7551921|16.7770819|119.663459 unknown
InChI: InChI=1S/C17H14BrN3/c1-12(18)15-19-16(13-8-4-2-5-9-13)21-17(20-15)14-10-6-3-7-11-14/h2-12H,1H3
charge 0 multiplicity 1
35 atoms
Br -0.416759 -4.180329 -1.818442
N  -1.21588 -1.352418 0.120627
N  1.20105 -1.52606 0.076793
N  0.141014 0.651288 0.041395
C  -0.053252 -2.064945 0.104268
C  -0.13666 -3.574312 0.13379
C  -1.075198 0.016812 0.084091
C  1.254844 -0.14816 0.045411
C  -2.302687 0.845671 0.0929
C  2.587838 0.496507 0.016153
C  -1.25164 -4.147973 1.004175
C  -2.210525 2.263871 0.100109
C  -3.581991 0.226239 0.092104
C  2.699185 1.913423 0.009896
C  3.764954 -0.29996 -0.007131
C  -3.380787 3.048872 0.109325
C  -4.749676 1.015366 0.099969
C  3.96955 2.522689 -0.016816
C  5.033317 0.313961 -0.034524
C  -4.653332 2.427836 0.109525
C  5.139837 1.725706 -0.038795
H  0.858198 -3.981562 0.364756
H  -2.228748 -3.737993 0.705759
H  -1.06827 -3.867395 2.060051
H  -1.274161 -5.247507 0.93327
H  -1.218109 2.723692 0.097381
H  -3.633781 -0.866369 0.081174
H  1.782797 2.510424 0.025227
H  3.659626 -1.388707 -0.006383
H  -3.30517 4.141671 0.115676
H  -5.733486 0.533747 0.096654
H  4.051306 3.615064 -0.021183
H  5.937853 -0.303513 -0.054228
H  -5.562428 3.03979 0.115513
H  6.126871 2.201375 -0.060491
