program: Gaussian 09
title: 000035210
version: EM64L-G09RevD.01
frameworkgroup: C1[X(C17H14ClN3)]
method: RPBEPBE
basis: SDD
operation: Freq
keyword: #p
keyword: freq=noraman
keyword: PBEPBE/SDD
title: #p freq=noraman PBEPBE/SDD
converged: YES YES NO NO
title: Mulliken charges:
elementType: Cl N N N C C C C C C C C C C C C C C C C C H H H H H H H H H H H H H H
charge: -0.067227 -0.028613 -0.033689 -0.054454 0.118627 -0.489032 -0.053282 -0.065668 0.289968 0.291509 -0.642641 -0.348311 -0.345667 -0.348657 -0.345830 -0.229948 -0.231236 -0.229432 -0.231089 -0.225791 -0.225690 0.300161 0.240634 0.258945 0.216778 0.268168 0.275062 0.268217 0.278185 0.230769 0.231717 0.230836 0.231801 0.232421 0.232461
chargesum: 0.00000
title: Mulliken charges with hydrogens summed into heavy atoms:
elementType: Cl N N N C C C C C C C C C C C C C C C C C
charge: -0.067227 -0.028613 -0.033689 -0.054454 0.118627 -0.188871 -0.053282 -0.065668 0.289968 0.291509 0.073716 -0.080143 -0.070606 -0.080440 -0.067645 0.000821 0.000481 0.001404 0.000711 0.006630 0.006771
polarizability: 3.38395748e+02 -4.54082474e+00 2.59233799e+02 -2.70324827e-01 6.30225009e+00 1.06257928e+02
1716.lowfreq: -0.0007 0.0012 0.0013 2.4319 3.9913 6.6035 17.9461 34.8617 38.4913
frequency: 17.5243 34.8586 38.4865 52.9848 72.1838 101.3267 103.4334 108.8338 201.5156 208.1347 216.6027 231.7791 237.4876 262.4661 279.6405 334.0863 376.5695 403.4789 404.8191 437.3738 442.7179 475.1649 527.2972 594.4494 613.1715 615.4011 627.4970 631.0482 669.9028 681.0739 696.2910 705.7955 715.9018 783.2283 807.4357 819.5803 859.5226 864.7939 866.8316 869.5954 918.7444 958.7772 960.6299 985.3972 989.4713 990.7879 999.2200 1001.1630 1010.8969 1011.7638 1020.4333 1020.6499 1047.1036 1071.5205 1075.5039 1083.8011 1111.2501 1131.0819 1167.4806 1172.6880 1172.9660 1177.4449 1182.0343 1226.8125 1264.2418 1302.2471 1311.9511 1331.1739 1352.6987 1389.6988 1391.6481 1392.7697 1408.7968 1428.1858 1436.3494 1456.7339 1459.2367 1467.7415 1470.6543 1484.5677 1496.2458 1586.9943 1588.5982 1611.5484 1612.7987 2991.6004 3088.0495 3104.2896 3129.3610 3129.4072 3130.3161 3142.2646 3142.6159 3156.7099 3156.9142 3169.3526 3169.7976 3175.5682 3176.0094
redmass: 6.6992 3.7148 3.9326 7.4705 5.2171 6.7055 5.3107 5.3039 4.5602 6.7548 6.4903 4.7035 1.0585 6.1258 4.2601 5.3417 5.3416 2.8409 2.8555 5.8216 3.7406 3.6655 6.2032 5.9927 6.5242 6.1060 5.3461 7.3484 5.6683 4.7156 2.5892 1.5012 2.3351 2.3018 2.4102 7.3567 6.4830 1.2462 1.2456 4.3448 13.0732 1.4460 1.4500 1.7313 6.1578 5.7633 1.3818 1.3786 1.3371 1.3371 2.4915 2.2750 1.5836 2.0357 1.6395 2.0837 2.6915 3.3147 4.3618 1.0668 1.0589 1.1996 1.1272 1.2971 2.1297 1.7293 1.3672 2.4531 2.8772 1.3728 6.1663 9.1815 3.3470 3.2665 2.4519 1.2720 1.9588 2.6873 1.6378 2.6673 3.2839 6.3723 6.4342 6.1472 6.2024 1.0391 1.0941 1.0902 1.0855 1.0855 1.0995 1.0895 1.0896 1.0943 1.0943 1.0948 1.0948 1.0991 1.0991
irintensity: 0.9767 0.0033 0.1373 1.6064 0.4574 0.4169 0.6805 1.0165 0.0374 0.0515 1.0376 0.0901 0.1743 0.1773 3.1638 1.9142 1.9720 0.0010 0.0058 7.5706 0.4190 12.0942 3.0799 35.4645 1.2763 1.8055 9.2045 26.0641 0.7682 0.0144 34.2682 0.0827 127.0598 74.4387 0.0210 4.4026 1.7859 0.0311 0.0143 5.4076 5.1357 0.0136 7.2768 20.0669 2.6015 0.6659 0.0672 0.0401 0.0803 0.8753 4.3068 23.7147 45.5617 7.6629 6.7427 7.9502 5.4414 3.4614 21.1569 0.5817 0.4370 60.0717 7.7846 10.1647 7.4670 8.6719 0.7295 25.1240 272.5268 36.0218 71.2638 19.5808 61.4127 98.9492 80.1875 75.0683 163.5311 571.0622 311.7714 66.1949 9.5443 1.2658 0.3191 30.3297 13.8185 13.8946 17.1220 2.9491 0.0481 0.0215 14.5579 11.5152 15.7611 37.6182 10.4387 5.8441 12.5432 33.4554 12.4294
temp: 298.150 k
press: 1.00000 atm
elementType: 17 7 7 7 6 6 6 6 6 6 6 6 6 6 6 6 6 6 6 6 6 1 1 1 1 1 1 1 1 1 1 1 1 1 1
symmnumber: 1
zpe: 703314.7 jmol-1
zpe.correction: 0.267878 hartree
zpe.thermalcorrener: 0.285713 hartree
zpe.thermalcorrenthalpy: 0.286657 hartree
zpe.thermalcorrgfe: 0.219213 hartree
zpe.sumelectzpe: -1279.086745 hartree
zpe.sumelectthermal: -1279.068911 hartree
zpe.sumelectthermalent: -1279.067967 hartree
zpe.sumelectthermalfe: -1279.135411 hartree
dipole: -0.2926 -2.2620 1.8840
dipole: 2.9584
quadrupole: -105.4491 -119.1333 -134.4584
quadrupole: -1.5692 1.1775 9.4947
quadrupole: 14.2312 0.5469 -14.7781 -1.5692 1.1775 9.4947
hfenergy: -1279.3546239 hartree
pointgroup: C01[X(C17H14Cl1N3)]
dipole: 0.0793023 0.8184327 0.8237573 debye
polarizability: 338.6233748|-0.2382941|258.7450612|-2.7359303|8.6379021|106.5190389 unknown
InChI: InChI=1S/C17H14ClN3/c1-12(18)15-19-16(13-8-4-2-5-9-13)21-17(20-15)14-10-6-3-7-11-14/h2-12H,1H3
charge 0 multiplicity 1
35 atoms
Cl -0.458676 -4.108466 -1.721753
N  -1.207537 -1.357515 0.104454
N  1.209593 -1.519495 0.061894
N  0.139593 0.653244 0.043377
C  -0.04146 -2.06389 0.084492
C  -0.120152 -3.575526 0.091944
C  -1.073839 0.012391 0.078422
C  1.256968 -0.140481 0.042117
C  -2.305316 0.83518 0.09097
C  2.58711 0.510192 0.019225
C  -1.206858 -4.163247 0.985959
C  -2.220371 2.253772 0.105343
C  -3.581424 0.2092 0.087244
C  2.692538 1.927577 0.014907
C  3.767644 -0.281309 0.000189
C  -3.394609 3.032786 0.118301
C  -4.753096 0.992379 0.098987
C  3.960462 2.542151 -0.00617
C  5.033556 0.337898 -0.02112
C  -4.663969 2.405282 0.115318
C  5.134175 1.750086 -0.023908
H  0.880947 -3.984235 0.288627
H  -1.235538 -5.260557 0.886424
H  -2.189802 -3.742055 0.723971
H  -0.992143 -3.911205 2.042374
H  -1.230329 2.718713 0.105289
H  -3.62746 -0.883593 0.071293
H  1.773611 2.520765 0.027302
H  3.666619 -1.370447 -0.000257
H  -3.324514 4.125917 0.130011
H  -5.734475 0.505809 0.093583
H  4.03767 3.634867 -0.00938
H  5.940783 -0.275751 -0.037136
H  -5.576189 3.01254 0.124322
H  6.119287 2.229921 -0.041012
