program: Gaussian 09
title: 000035187
version: EM64L-G09RevD.01
frameworkgroup: C1[X(C6HCl8N3)]
method: RPBEPBE
basis: SDD
operation: Freq
keyword: #p
keyword: freq=noraman
keyword: PBEPBE/SDD
title: #p freq=noraman PBEPBE/SDD
converged: NO NO NO NO
title: Mulliken charges:
elementType: Cl Cl Cl Cl Cl Cl Cl Cl N N N C C C C C C H
charge: 0.134744 0.159416 0.135063 0.130780 0.163686 0.131022 0.068515 0.068515 0.063611 0.057961 0.133619 0.257138 0.250440 0.222603 -0.794951 -0.791693 -0.752272 0.361801
chargesum: 0.00000
title: Mulliken charges with hydrogens summed into heavy atoms:
elementType: Cl Cl Cl Cl Cl Cl Cl Cl N N N C C C C C C
charge: 0.134744 0.159416 0.135063 0.130780 0.163686 0.131022 0.068515 0.068515 0.063611 0.057961 0.133619 0.257138 0.250440 0.222603 -0.794951 -0.791693 -0.390470
polarizability: 1.78136304e+02 9.67890479e+00 1.72021219e+02 -3.03301867e-03 1.92077107e-03 1.45418277e+02
1716.lowfreq: -19.2572 -14.3445 -0.8815 -0.0008 0.0017 0.0027 4.6102 8.5072 10.6452
frequency: -16.7229 -12.5926 10.2213 53.1630 75.8914 84.3603 84.7696 98.4297 152.2768 158.1600 171.8877 206.7008 215.5640 237.2373 245.3448 250.6614 260.8242 279.1477 307.9839 314.8826 351.0298 381.4802 396.8552 453.1105 615.1316 618.4725 623.0396 649.9527 686.9522 709.5727 748.1610 769.0478 780.8917 781.5273 788.6570 867.9520 912.1034 981.3420 997.7114 1158.8530 1216.9881 1219.0687 1293.3621 1307.1609 1366.5225 1452.6161 1460.3561 3147.6937
redmass: 25.6611 28.4464 33.5157 25.9848 30.3617 24.7233 21.3395 20.1499 31.2472 32.6450 32.8972 20.1613 21.0873 22.1780 20.0710 26.5184 18.8136 25.0882 20.6446 20.7696 22.8649 27.3439 22.8393 13.7854 13.4192 13.3806 10.4288 12.2519 11.8870 7.8055 12.2048 10.4014 10.0767 12.1693 9.8207 12.4230 13.9743 7.7657 11.8879 6.2178 1.0668 2.0693 11.7611 3.2368 10.9203 9.6462 11.8891 1.0890
irintensity: 0.4158 0.3224 0.0289 0.1313 0.1039 0.3955 0.0262 0.0092 0.6448 0.7457 0.4736 0.0213 0.0897 1.5167 0.1241 0.0922 1.9228 0.0436 2.7212 1.1658 3.5596 0.3192 1.6382 4.0250 1.7534 5.3731 91.3413 106.3760 394.6214 29.3173 134.4804 0.8258 12.7692 0.0072 7.5677 2.9065 0.0583 53.8905 47.2861 6.6403 7.1529 3.1127 26.9726 69.4395 0.0128 262.2434 214.0491 0.0812
temp: 298.150 k
press: 1.00000 atm
elementType: 17 17 17 17 17 17 17 17 7 7 7 6 6 6 6 6 6 1
symmnumber: 1
zpe: 179099.6 jmol-1
zpe.correction: 0.068215 hartree
zpe.thermalcorrener: 0.084809 hartree
zpe.thermalcorrenthalpy: 0.085753 hartree
zpe.thermalcorrgfe: 0.020196 hartree
zpe.sumelectzpe: -4072.659506 hartree
zpe.sumelectthermal: -4072.642913 hartree
zpe.sumelectthermalent: -4072.641969 hartree
zpe.sumelectthermalfe: -4072.707526 hartree
dipole: -0.8925 0.7473 -0.0002
dipole: 1.1641
quadrupole: -161.2058 -152.5485 -149.5445
quadrupole: -1.6446 -0.0119 0.0054
quadrupole: -6.7729 1.8845 4.8884 -1.6446 -0.0119 0.0054
hfenergy: -4072.7277219 hartree
pointgroup: C01 [X(C6H1Cl8N3)]
dipole: 0.3426456 -0.3038716 0.0000789 debye
dipolederiv: -0.3248563 0.0460407 0.2916845 0.0425552 -0.1842918 0.0209502 0.2499327 0.0442175 -0.530328 -0.2456548 -0.2275515 0.0006075 -0.2779459 -0.4918994 0.0011406 0.0006411 0.000701 -0.1034686 -0.3266967 0.0448793 -0.2927793 0.0415102 -0.1835382 -0.0215456 -0.2507836 -0.0448851 -0.5275054 -0.3036924 0.0836226 0.178228 0.0823338 -0.2314083 -0.2412054 0.1388132 -0.2242805 -0.5385366 -0.1384165 -0.176587 -0.0003118 -0.1372093 -0.5992936 -0.0008758 -0.0000671 -0.0006847 -0.102661 -0.3028307 0.0842904 -0.1782385 0.0829329 -0.232679 0.2420727 -0.1387171 0.2250148 -0.5367185 -0.1968362 -0.1525851 -0.2347605 -0.1095794 -0.2270756 -0.0835088 -0.1255932 -0.1070334 -0.5073277 -0.1972289 -0.152567 0.2351593 -0.1096101 -0.2269701 0.0832316 0.1259984 0.1066944 -0.5069959 -1.0436378 0.2797303 -0.0000166 0.2924502 -0.4849044 0.0000631 -0.0010577 0.0003643 -0.1349137 -0.9989087 -0.2858385 -0.0000975 -0.4181011 -0.6388723 0.0001375 -0.0004626 -0.0002463 -0.1199454 -0.3847843 0.1189534 -0.0002427 0.116366 -1.1545066 -0.0002633 -0.0000838 0.0005149 -0.0855886 0.7056138 -0.4303354 -0.0000814 -0.4074116 0.8167562 0.0002301 -0.0005593 0.0010151 0.0326069 1.1964627 0.0235056 0.0000951 0.003659 0.2906594 -0.0000714 -0.0005727 -0.000109 0.0602724 0.6937228 0.1616987 0.0000254 0.3067038 0.984287 0.000127 0.0003738 -0.0001406 0.0288754 0.8528995 0.3335122 0.0006618 0.2910825 0.9276226 -0.0007715 0.0012501 -0.0014999 1.2296725 0.6226044 0.0330575 0.0005152 0.0963232 1.2013005 0.0000347 0.0013741 0.0000403 1.2472031 0.3929554 0.1797864 -0.0004498 0.1349249 0.3692823 0.0002958 -0.0005003 0.0003222 1.1207604 -0.0007152 0.0363874 0.0000016 -0.0309843 0.0655313 -0.0000415 0.0000139 -0.0000053 -0.0254015 unknown
polarizability: 178.6810961|9.4896217|171.47642|0.0145078|-0.0002586|145.418284 unknown
InChI: InChI=1S/C6HCl8N3/c7-1(8)2-15-3(5(9,10)11)17-4(16-2)6(12,13)14/h1H
charge 0 multiplicity 1
18 atoms
Cl -2.765611 2.029622 1.520716
Cl -0.762565 3.691744 -0.004442
Cl -2.772321 2.026809 -1.517724
Cl 3.50608 -0.79492 -1.51937
Cl 3.427664 1.807583 0.003733
Cl 3.506816 -0.799629 1.518695
Cl -2.121166 -3.070916 -1.53385
Cl -2.122879 -3.070142 1.532728
N  0.577481 1.077327 -0.000312
N  0.819353 -1.324114 0.000402
N  -1.383665 -0.333517 -0.000659
C  -0.773112 0.880625 -0.001146
C  1.325791 -0.057834 0.000684
C  -0.540377 -1.405313 -0.000129
C  -1.697453 2.104289 -0.001108
C  2.854329 0.058628 0.001303
C  -1.117064 -2.803996 -0.000086
H  -0.311201 -3.546747 0.000565
