program: Gaussian 09
title: 000037431
version: EM64L-G09RevD.01
frameworkgroup: C1[X(C23H28N2O3)]
method: RPBEPBE
basis: SDD
operation: Freq
keyword: #p
keyword: freq=noraman
keyword: PBEPBE/SDD
title: #p freq=noraman PBEPBE/SDD
converged: NO YES NO NO
title: Mulliken charges:
elementType: O O O N N C C C C C C C C C C C C C C C C C C C C C C C H H H H H H H H H H H H H H H H H H H H H H H H H H H H
charge: -0.267671 -0.247089 -0.214039 -0.217395 -0.109595 0.097943 0.276354 0.060046 0.263760 -0.735775 -0.330099 -0.463919 -0.224632 -0.576360 -0.333834 -0.334265 -0.380492 -0.338256 -0.321509 -0.325008 -0.257299 0.515135 -0.228406 -0.452161 -0.347020 -0.217851 -0.229234 -0.242527 0.257754 0.223582 0.228208 0.187435 0.226294 0.196915 0.225908 0.193184 0.227117 0.265457 0.233947 0.191048 0.205363 0.201814 0.196819 0.237399 0.256517 0.212424 0.194139 0.199175 0.211520 0.228446 0.226926 0.232354 0.235373 0.228156 0.227281 0.230639
chargesum: 0.00000
title: Mulliken charges with hydrogens summed into heavy atoms:
elementType: O O O N N C C C C C C C C C C C C C C C C C C C C C C C
charge: -0.267671 -0.247089 -0.214039 -0.217395 -0.109595 0.097943 0.276354 0.060046 0.263760 -0.026231 0.083630 -0.041095 0.195669 -0.076956 0.062578 0.064369 -0.143094 -0.081739 0.085054 0.085687 -0.028853 0.515135 -0.001481 -0.219806 -0.111647 0.010305 -0.001953 -0.011887
polarizability: 2.76448650e+02 -2.27577541e+01 2.54515606e+02 -2.03213598e+00 1.41114408e+01 2.47236144e+02
1716.lowfreq: -4.7711 -0.0008 -0.0007 0.0004 5.0319 7.5404 10.2114 22.3793 25.2019
frequency: 9.7151 22.2545 24.9134 29.9188 37.8969 42.7400 51.4883 61.6586 92.3284 109.9397 134.6093 143.1913 167.0488 187.0793 193.8496 213.8635 217.8796 231.6519 243.7446 250.6188 282.0665 291.5627 311.7976 318.8516 337.1611 345.3325 379.0196 396.1871 402.3988 405.7597 426.9478 457.5598 470.4058 476.4039 485.1110 507.6333 545.1169 563.8910 577.2434 594.4153 615.5741 627.0982 658.7516 688.8953 703.2075 717.3025 725.0872 747.6024 754.5105 759.8629 788.3065 801.9057 807.7151 819.4481 842.2639 853.8379 857.7576 862.8790 868.6544 891.3573 900.7756 917.8723 938.4884 965.3727 977.3020 979.1501 986.9820 990.3550 991.1167 998.1873 1016.3428 1026.3954 1027.0724 1031.5669 1039.0713 1051.5024 1059.6569 1071.4639 1081.2332 1086.9648 1091.3291 1104.3464 1107.1908 1108.3187 1137.9451 1142.0176 1157.8601 1171.3549 1173.1333 1181.5465 1187.6417 1190.3558 1206.4836 1209.4713 1220.0798 1248.7135 1265.4195 1273.1468 1276.5835 1290.0262 1294.2812 1302.3310 1325.4471 1325.8323 1336.4465 1342.4664 1355.1887 1364.8480 1364.9546 1368.6051 1370.8990 1378.7033 1388.8556 1389.3720 1408.4649 1443.8371 1444.1321 1447.2713 1449.6222 1450.8651 1453.4898 1457.2935 1459.3936 1461.6561 1462.7713 1465.7225 1478.1504 1480.2011 1484.9757 1596.5462 1603.2759 1615.1738 1622.8150 1652.7931 2854.2035 2855.3720 2870.7504 2949.0465 2949.2398 2955.4057 2984.0260 2995.2803 2996.7358 3020.1515 3024.1356 3032.9351 3037.9357 3040.7715 3057.7113 3076.9529 3081.1608 3100.9194 3109.2818 3112.4754 3123.9267 3129.3288 3135.8132 3140.3907 3146.8915 3156.1116 3164.6137 3169.1443
redmass: 5.6722 4.0470 5.7290 3.9232 4.4903 3.2473 5.7888 4.8963 3.7958 6.0259 3.9643 3.8872 4.3464 2.8836 3.0230 2.1407 1.3582 4.2712 1.8804 3.7211 2.4935 5.7420 2.8512 2.3970 3.4873 3.0915 3.3759 2.1705 2.7979 3.0215 3.4253 3.2944 2.7980 6.9491 3.8811 3.2375 5.2468 3.7351 2.6042 2.7789 6.0810 5.0785 4.7222 5.6087 2.0287 3.5623 2.3462 2.0157 4.3566 1.3585 2.6440 3.6923 3.4806 3.0018 1.5936 1.2517 2.3516 1.4677 2.2650 2.6691 2.3966 1.4575 1.4012 2.8238 1.3941 1.3152 2.4044 5.4906 2.3243 1.4189 2.5863 2.2264 2.1791 2.8568 2.2805 2.2721 2.0068 2.4603 3.1202 1.6063 3.4932 2.4153 1.8986 2.0074 2.4418 2.5380 2.5287 1.1775 1.0556 1.6429 1.1135 1.0640 1.1935 2.7934 1.2033 3.4440 1.3785 1.4323 1.3272 1.2987 1.2359 1.7314 3.3018 1.3030 1.4613 1.2271 1.3970 1.7299 1.4558 1.3550 1.3117 1.2181 2.8930 1.6161 4.1691 2.0945 1.0849 1.0851 1.1319 1.4893 1.0937 1.2320 1.0901 1.0831 1.3486 1.0598 1.1016 3.1571 2.1594 6.1654 7.5078 6.0810 7.6789 10.4852 1.0710 1.0705 1.0694 1.0662 1.0579 1.0663 1.0586 1.0622 1.0341 1.1023 1.0893 1.0889 1.1026 1.0905 1.0974 1.0962 1.0977 1.1003 1.1013 1.0880 1.0858 1.0854 1.0907 1.0905 1.0959 1.0949 1.1014 1.0993
irintensity: 0.1013 0.0490 0.4033 0.1040 0.5424 0.3950 0.9407 0.6705 1.0661 2.1136 0.9596 0.1321 1.6847 3.2909 6.4757 0.2335 1.4848 1.6800 0.8403 4.4718 2.6065 8.0832 2.5133 17.8120 1.3186 1.1384 2.2291 0.8525 0.3373 2.4497 3.0780 8.2890 1.1720 1.3204 12.5608 2.8573 12.1969 4.2782 8.6236 2.2817 1.7790 16.7009 5.5763 4.3145 42.6264 21.2458 12.0873 36.1383 0.6032 94.0947 8.1059 5.2842 13.9732 9.6222 0.1073 0.2270 0.8107 1.8233 4.9160 4.5064 6.2433 3.9735 2.8710 58.6123 0.1338 0.0993 48.7387 0.2402 13.2149 2.8460 6.8379 9.6665 14.5736 6.3374 18.7800 23.6010 7.6941 9.0612 14.9727 20.0653 71.1800 8.8377 20.6048 5.9074 11.3140 47.5356 6.4636 6.9839 0.1217 68.4400 1.4330 1.8148 9.5452 2.2319 12.2730 6.1399 12.1990 1.4133 5.1327 19.3124 0.1217 26.4210 84.6801 3.5231 21.4120 8.4650 5.3708 3.6691 0.6379 2.7602 2.6007 21.3200 1.9172 1.2409 4.3495 10.3317 1.8356 1.3608 8.9467 17.6841 20.7560 2.6834 8.1789 18.9968 33.0410 12.1823 20.8356 97.4766 19.4210 0.2192 51.8633 7.0808 127.4437 169.6084 42.9374 38.1456 262.5539 49.9086 45.2099 84.6686 32.1125 31.5525 13.9412 18.6994 44.9825 42.8199 8.8130 15.0570 45.7467 44.3489 44.9444 19.0656 10.4061 9.4653 1.8676 0.1775 9.2331 11.5380 36.9326 29.8995 22.5221 12.9683
temp: 298.150 k
press: 1.00000 atm
elementType: 8 8 8 7 7 6 6 6 6 6 6 6 6 6 6 6 6 6 6 6 6 6 6 6 6 6 6 6 1 1 1 1 1 1 1 1 1 1 1 1 1 1 1 1 1 1 1 1 1 1 1 1 1 1 1 1
symmnumber: 1
zpe: 1222765.9 jmol-1
zpe.correction: 0.465727 hartree
zpe.thermalcorrener: 0.491637 hartree
zpe.thermalcorrenthalpy: 0.492581 hartree
zpe.thermalcorrgfe: 0.406411 hartree
zpe.sumelectzpe: -1226.327574 hartree
zpe.sumelectthermal: -1226.301664 hartree
zpe.sumelectthermalent: -1226.300720 hartree
zpe.sumelectthermalfe: -1226.386890 hartree
dipole: -1.0372 1.6669 1.6441
dipole: 2.5607
quadrupole: -163.1561 -169.5657 -163.7397
quadrupole: -16.5335 -13.4998 -13.2666
quadrupole: 2.3311 -4.0785 1.7475 -16.5335 -13.4998 -13.2666
hfenergy: -1226.7933008 hartree
pointgroup: C01 [X(C23H28N2O3)]
dipole: 0.2703836 0.3791801 -0.8933632 debye
polarizability: 273.4081921|17.4656926|243.5014106|-12.8707814|-15.9819274|261.2907972 unknown
InChI: InChI=1S/C23H28N2O3/c1-23(28-15-7-12-24-13-16-27-17-14-24)20-10-5-6-11-21(20)25(22(23)26)18-19-8-3-2-4-9-19/h2-6,8-11H,7,12-18H2,1H3
charge 0 multiplicity 1
56 atoms
O  -0.745913 -1.436954 1.905247
O  -5.134151 2.101396 -0.848067
O  2.316101 -1.884875 2.176155
N  2.124295 -1.281225 -0.103216
N  -3.506182 0.788945 1.169409
C  0.116486 -2.11597 0.928897
C  -0.122986 -1.704992 -0.521659
C  1.634916 -1.75625 1.12671
C  1.092714 -1.237218 -1.085876
C  -0.09428 -3.615684 1.199399
C  -3.133786 0.216623 2.486423
C  -1.685924 0.552273 2.905712
C  -0.645184 0.03914 1.906929
C  3.531459 -0.917576 -0.31631
C  -3.729512 2.255887 1.197067
C  -4.671783 0.106352 0.554563
C  -1.290202 -1.737904 -1.295193
C  1.176667 -0.811161 -2.423432
C  -3.9807 2.775706 -0.228701
C  -4.903149 0.646867 -0.865878
C  -1.230578 -1.312123 -2.648847
C  3.76244 0.568698 -0.58404
C  -0.00903 -0.859444 -3.200795
C  4.630326 0.980046 -1.624287
C  3.148046 1.553231 0.229418
C  4.885929 2.352642 -1.848235
C  3.398337 2.924107 0.005685
C  4.268827 3.329119 -1.033962
H  0.228437 -3.842954 2.229095
H  0.484949 -4.233756 0.492276
H  -1.165038 -3.859877 1.091385
H  -3.836504 0.547413 3.292965
H  -3.216115 -0.88256 2.408753
H  -1.551312 1.645523 3.023026
H  -1.491936 0.097749 3.89589
H  0.376872 0.337359 2.223597
H  -0.858373 0.431663 0.89304
H  4.051217 -1.222082 0.613067
H  3.94351 -1.520774 -1.148307
H  -4.603298 2.521909 1.845938
H  -2.836098 2.759112 1.610851
H  -4.466606 -0.980165 0.508491
H  -5.604688 0.255322 1.155835
H  -2.235028 -2.0774 -0.85644
H  2.110931 -0.434621 -2.85011
H  -4.235375 3.84858 -0.224084
H  -3.073221 2.606695 -0.847952
H  -4.016132 0.418051 -1.496503
H  -5.809163 0.211133 -1.319263
H  -2.133007 -1.331818 -3.269199
H  0.024146 -0.530669 -4.245549
H  5.112118 0.2256 -2.259743
H  2.477598 1.242766 1.03961
H  5.560323 2.65807 -2.656099
H  2.919403 3.676928 0.641905
H  4.463106 4.393449 -1.206792
