program: Gaussian 09
title: 000035190
version: EM64L-G09RevD.01
frameworkgroup: C1[X(C7Cl11N3)]
method: RPBEPBE
basis: SDD
operation: Freq
keyword: #pfreq=noraman
keyword: PBEPBE/SDD
title: #p freq=noraman PBEPBE/SDD
converged: YES YES NO NO
title: Mulliken charges:
elementType: Cl Cl Cl Cl Cl Cl Cl Cl Cl Cl Cl N N N C C C C C C C
charge: 0.158206 0.158234 0.181175 0.161176 0.161109 0.131891 0.165877 0.134447 0.134200 0.165876 0.132129 0.132329 0.132338 0.075359 -0.585689 0.261925 -0.569292 0.236145 0.236148 -0.801792 -0.801788
chargesum: 0.00000
title: Mulliken charges with hydrogens summed into heavy atoms:
polarizability: 2.26861367e+02 -3.22744491e-04 2.22081520e+02 1.23514213e+01 -2.97455153e-03 1.65171369e+02
1716.lowfreq: -9.2949 -6.2291 -3.3814 -0.0024 -0.0015 -0.0014 6.5151 7.4116 9.1278
frequency: 2.6879 5.2568 8.9434 40.1564 44.9039 72.7006 77.8346 84.3863 93.7425 149.8570 153.3211 159.9442 160.2109 171.5732 179.8447 204.5605 207.7645 221.3786 231.6815 234.9755 252.0288 253.0930 276.9146 282.8497 296.4375 299.4372 332.3702 338.4766 351.6911 375.0162 394.3964 399.6310 477.1936 569.0051 615.5374 648.8951 651.3377 675.9608 707.6302 711.5483 749.9962 764.1308 773.3665 781.1657 808.6118 835.5664 872.9652 912.0882 952.9380 993.6776 1018.1443 1172.6138 1272.6920 1277.0579 1345.0097 1447.5289 1451.7298
redmass: 34.1631 33.8779 33.0569 27.4480 33.3698 28.8397 27.5105 23.1672 24.6822 34.3250 29.4561 31.3746 28.6333 29.7377 33.8302 23.3219 32.2738 21.4401 22.3718 28.2814 26.4473 26.6169 30.8954 23.7615 27.0808 23.6123 25.5512 24.9723 24.1347 33.0541 23.3034 23.9823 15.1497 13.8065 13.5401 13.2457 13.3164 13.3711 13.1913 12.8000 12.6853 12.4455 12.5652 12.1948 12.3761 12.3358 12.6115 14.0004 12.2809 12.7426 12.4442 12.7867 12.2735 12.2477 12.0064 12.8843 12.8838
irintensity: 0.1136 0.0041 0.0029 0.1378 0.0009 0.0486 0.0334 0.1133 0.0002 0.0855 0.0306 0.5342 0.9040 0.1345 0.0605 0.0947 0.1359 0.0038 0.6005 0.1365 0.1349 0.1985 0.0098 0.0003 1.4928 0.9428 1.9804 3.0309 2.3666 0.1229 0.5426 1.8946 2.4898 26.9489 0.1945 185.4195 124.7160 291.0725 109.6135 20.9269 106.7031 40.9990 12.1439 0.9963 0.0962 57.1733 21.0841 0.0571 30.4703 39.6439 10.0362 2.9867 64.4071 37.9945 0.6420 255.0734 182.6481
temp: 298.150 k
press: 1.00000 atm
elementType: 17 17 17 17 17 17 17 17 17 17 17 7 7 7 6 6 6 6 6 6 6
symmnumber: 1
zpe: 172528.2 jmol-1
zpe.correction: 0.065713 hartree
zpe.thermalcorrener: 0.089251 hartree
zpe.thermalcorrenthalpy: 0.090195 hartree
zpe.thermalcorrgfe: 0.004047 hartree
zpe.sumelectzpe: -5490.018048 hartree
zpe.sumelectthermal: -5489.994510 hartree
zpe.sumelectthermalent: -5489.993566 hartree
zpe.sumelectthermalfe: -5490.079714 hartree
dipole: -0.0958 0.0001 0.0202
dipole: 0.0979
quadrupole: -197.7276 -200.5136 -192.4158
quadrupole: -0.0025 -0.3305 0.0081
quadrupole: -0.8420 -3.6279 4.4698 -0.0025 -0.3305 0.0081
hfenergy: -5490.0837604 hartree
pointgroup: C01 [X(C7Cl11N3)]
dipole: -0.0377269 0.0000288 0.0077187 debye
dipolederiv: -0.1487046 -0.0848926 -0.0268327 -0.077306 -0.3680438 -0.1607021 -0.0070307 -0.220744 -0.2203457 -0.1486732 0.084911 -0.0267413 0.0773383 -0.3684124 0.1605376 -0.0069368 0.2206156 -0.2199079 -0.7795399 0.0003902 -0.122077 0.0003949 -0.0723938 0.0000838 -0.0841587 0.000092 -0.1148366 -0.1942597 0.0812327 -0.0384667 0.1436811 -0.4426293 0.2218229 -0.0720188 0.2696198 -0.2904638 -0.1946869 -0.0815184 -0.0388804 -0.143971 -0.4416446 -0.2220318 -0.0726055 -0.2698148 -0.2912755 -0.2560622 -0.0520614 0.1990065 -0.0638931 -0.3219817 0.236682 0.2073005 0.1831314 -0.4585269 -0.6331575 -0.069995 -0.096687 -0.0449237 -0.0893008 -0.0114575 -0.0967324 -0.0178523 -0.1155331 -0.139693 0.0147481 -0.0698281 0.0367493 -0.3338991 -0.2604275 -0.0600845 -0.2123428 -0.5596047 -0.1395954 -0.0161107 -0.0683265 -0.0382236 -0.333641 0.2598871 -0.0585107 0.2120495 -0.5614469 -0.6323445 0.0700399 -0.0988898 0.0450232 -0.0893399 0.0117086 -0.098454 0.0184539 -0.1163179 -0.2569174 0.0533629 0.1993191 0.065432 -0.3222457 -0.2367681 0.2076827 -0.1831131 -0.4560004 -0.8715581 -0.4386981 -0.1316435 -0.3197703 -0.584712 -0.0306905 -0.1828091 -0.0711601 -0.1188067 -0.8714713 0.4388506 -0.1319559 0.3198978 -0.5848687 0.030632 -0.1821222 0.0708331 -0.1188103 -0.3491296 0.0000787 -0.0330086 -0.0000201 -1.0813431 0.0000513 -0.0523805 -0.0007586 -0.1275233 0.154848 0.0000389 0.0717707 -0.0001031 0.8086175 0.0000938 0.0387355 0.0000903 0.5000778 1.102891 -0.0001159 0.1527506 -0.0000782 0.4181716 -0.0001451 0.2324917 0.000318 0.0211194 1.1589766 -0.0001558 0.1730254 0.0000373 0.9908756 0.0001743 0.1776926 0.0000753 0.7148175 0.4166299 0.3515146 0.0593265 0.3523248 0.9938638 0.057251 0.0895555 0.0783477 0.0612768 0.4162456 -0.3511506 0.0595482 -0.3522445 0.9939838 -0.0575208 0.0905709 -0.0796765 0.0614995 1.1833023 0.1093498 -0.0160405 0.1709213 0.6144552 0.0514182 -0.0356665 0.0483643 1.2051212 1.1829 -0.1098188 -0.0153692 -0.1712665 0.6144884 -0.0505991 -0.0345191 -0.0465286 1.2054877 unknown
polarizability: 226.704043|-0.0026418|222.0815172|12.7372759|0.0118284|165.3286956 unknown
InChI: InChI=1S/C7Cl11N3/c8-4(9,7(16,17)18)1-19-2(5(10,11)12)21-3(20-1)6(13,14)15
charge 0 multiplicity 1
21 atoms
Cl 2.664103 1.500577 1.697971
Cl 2.664189 -1.502315 1.696406
Cl 4.893542 -0.000882 -0.265788
Cl 2.675283 1.50623 -1.645573
Cl 2.673736 -1.503421 -1.648115
Cl -1.175202 3.426987 -1.484327
Cl -3.764475 2.302902 -0.416899
Cl -1.735259 3.446046 1.501749
Cl -1.741554 -3.442734 1.503303
Cl -3.763432 -2.302349 -0.425004
Cl -1.171388 -3.430453 -1.480889
N  0.086683 -1.203446 0.298437
N  0.086762 1.203093 0.29932
N  -1.975318 0.000026 -0.059134
C  2.229508 -0.000362 0.688789
C  0.7088 -0.000235 0.417706
C  3.085065 0.000342 -0.634183
C  -1.251634 -1.145473 0.058914
C  -1.251599 1.145386 0.059935
C  -1.968829 2.49327 -0.080499
C  -1.969082 -2.493188 -0.082021
