program: Gaussian 09
title: 000035154
version: EM64L-G09RevD.01
frameworkgroup: C1[X(C6H6Br3N3)]
method: RPBEPBE
basis: SDD
operation: Freq
keyword: #p
keyword: freq=noraman
keyword: PBEPBE/SDD
title: #p freq=noraman PBEPBE/SDD
converged: YES YES NO NO
title: Mulliken charges:
elementType: Br Br Br N N N C C C C C C H H H H H H
charge: 0.029537 0.029679 0.029714 0.013262 0.013382 0.014912 0.138500 0.138247 0.138177 -0.791574 -0.791624 -0.791596 0.304799 0.304779 0.304897 0.305000 0.305020 0.304889
chargesum: 0.00000
title: Mulliken charges with hydrogens summed into heavy atoms:
elementType: Br Br Br N N N C C C C C C
charge: 0.029537 0.029679 0.029714 0.013262 0.013382 0.014912 0.138500 0.138247 0.138177 -0.181997 -0.181728 -0.181686
polarizability: 1.38546204e+02 4.83973987e-03 1.37476306e+02 3.47731384e-01 -5.00477609e-02 1.24176347e+02
1716.lowfreq: -6.4451 -4.5677 -1.7096 -0.0002 0.0002 0.0003 20.2157 20.8688 37.6575
frequency: 20.1981 20.8629 37.6444 42.9066 91.6250 92.1075 197.5741 198.1852 210.1928 269.5282 270.0263 445.2190 495.5665 496.0026 565.0620 576.7553 576.8595 652.7480 732.8835 733.6025 849.4759 849.7283 859.2494 915.8977 918.4260 981.9309 982.4118 1089.6055 1116.7669 1117.2079 1217.7774 1230.7263 1232.6686 1232.9955 1333.5466 1334.2515 1381.3456 1425.9815 1426.0370 1444.4737 1468.1018 1468.5860 3085.7122 3085.8229 3086.0271 3183.4705 3183.8264 3183.9429
redmass: 31.1673 30.7157 48.3219 3.9567 11.1650 11.3126 11.4888 11.4825 15.7936 2.2550 2.2536 2.3941 8.0897 8.0755 6.4714 7.5909 7.5911 4.8226 7.3296 7.3596 1.7339 1.7377 10.8848 1.5979 13.8242 3.2204 3.2363 2.0356 1.2607 1.2605 2.0012 1.1471 1.1665 1.1666 4.6907 4.6890 2.4857 1.2044 1.2032 1.6715 7.4646 7.5378 1.0558 1.0558 1.0558 1.1128 1.1128 1.1127
irintensity: 0.2048 0.2170 0.0196 0.0006 2.4446 2.4530 3.0538 3.1681 0.0090 3.1523 3.2118 0.0001 0.3639 0.3953 30.3959 38.3991 38.2217 4.1220 1.6735 1.5003 2.0299 2.0442 3.0710 0.0001 0.3341 0.0468 0.0642 0.0025 14.9065 15.0010 0.0021 20.2155 0.1632 0.0371 26.2368 25.8229 12.0094 1.0371 1.3252 3.2890 298.1490 298.1303 1.2248 2.6767 13.5025 0.0011 0.0003 0.0005
temp: 298.150 k
press: 1.00000 atm
elementType: 35 35 35 7 7 7 6 6 6 6 6 6 1 1 1 1 1 1
symmnumber: 1
zpe: 307509.3 jmol-1
zpe.correction: 0.117124 hartree
zpe.thermalcorrener: 0.129703 hartree
zpe.thermalcorrenthalpy: 0.130647 hartree
zpe.thermalcorrgfe: 0.071383 hartree
zpe.sumelectzpe: -435.974779 hartree
zpe.sumelectthermal: -435.962200 hartree
zpe.sumelectthermalent: -435.961256 hartree
zpe.sumelectthermalfe: -436.020519 hartree
dipole: 0.0302 -0.0034 4.5660
dipole: 4.5661
quadrupole: -100.9494 -100.6680 -88.7082
quadrupole: 0.0005 0.0871 -0.0109
quadrupole: -4.1742 -3.8928 8.0670 0.0005 0.0871 -0.0109
hfenergy: -436.0919027 hartree
pointgroup: C01 [X(C6H6Br3N3)]
dipole: -0.0062149 0.0002541 1.7964246 debye
dipolederiv: -0.3582027 -0.0078346 -0.0925686 -0.0080218 -0.074518 -0.0027634 -0.2413017 -0.0067876 -0.2617012 -0.1401209 -0.1205971 0.0462051 -0.1189722 -0.2907929 0.0805768 0.1161474 0.2115045 -0.2626957 -0.1534136 0.1279151 0.0505032 0.1261556 -0.2773806 -0.0777324 0.1278171 -0.2046315 -0.2631514 -0.9472932 -0.2990952 0.0274267 -0.299817 -0.6411305 -0.0420189 0.0133249 -0.0162312 -0.1395006 -0.9789579 0.2806448 0.0254552 0.2817767 -0.6098593 0.0433803 0.0127884 0.0167907 -0.1393762 -0.4580136 0.0180155 -0.0506529 0.0179936 -1.1298071 -0.0015124 -0.02202 -0.0008734 -0.1397068 1.1498478 0.0173611 0.1559768 0.0170407 0.5184177 0.0039693 0.1470278 0.0037655 0.0429152 0.6638967 0.2638959 -0.0747481 0.2650569 1.0030346 -0.1421982 -0.0726549 -0.1387411 0.0434377 0.693372 -0.2802633 -0.0826255 -0.2816591 0.9737513 0.1383499 -0.0804912 0.135357 0.0435992 0.0898639 0.0005509 0.0902184 0.000374 0.0777649 0.0029804 0.1347686 0.0043255 0.4015688 0.0804912 0.0040051 -0.0454387 0.0052324 0.0858381 -0.0753879 -0.0656107 -0.1135747 0.401916 0.0811681 -0.0042483 -0.0495348 -0.0052969 0.0851248 0.0725439 -0.0718892 0.1094452 0.4023101 0.0581738 -0.0034688 -0.0410336 0.0552557 0.0342055 -0.0627641 -0.0205586 -0.0582484 -0.02127 0.060702 0.0046283 -0.0442731 -0.0536929 0.0318623 0.0602946 -0.023478 0.0567145 -0.0216412 0.0185582 -0.0323345 -0.033642 0.0251287 0.0754883 0.0655199 -0.0395789 0.045512 -0.0228536 0.0595694 0.0558098 0.0742251 -0.0039178 0.03245 0.0077712 0.0617851 -0.0084601 -0.0204554 0.0623356 -0.0542431 0.0744619 0.0055652 0.0297444 -0.0037786 0.0611557 0.0117332 -0.0205243 0.0180233 0.0292584 -0.0299551 -0.0282019 0.0758064 -0.0672304 -0.0372317 -0.0475999 -0.0228707 unknown
polarizability: 138.5388448|0.0731661|137.4812787|-0.3959481|0.0299011|124.1787335 unknown
InChI: InChI=1S/C6H6Br3N3/c7-1-4-10-5(2-8)12-6(3-9)11-4/h1-3H2
charge 0 multiplicity 1
18 atoms
Br -3.509487 -0.097401 -1.425407
Br 1.687078 3.06285 -1.435007
Br 1.848482 -2.966887 -1.435938
N  -0.733956 1.194466 0.484234
N  -0.668591 -1.231946 0.484722
N  1.399997 0.037726 0.490269
C  -1.337368 -0.035874 0.48158
C  0.636297 1.175436 0.482823
C  0.698589 -1.139384 0.482852
C  -2.835215 -0.076139 0.490095
C  1.350448 2.492652 0.484911
C  1.482267 -2.416473 0.484326
H  -3.263024 0.831142 0.93519
H  -3.213789 -1.003699 0.938019
H  2.345915 2.414792 0.940221
H  0.732395 3.289287 0.917938
H  0.907787 -3.245207 0.917115
H  2.472174 -2.285641 0.939558
