program: Gaussian 09
title: 000035161
version: EM64L-G09RevD.01
frameworkgroup: C1[X(C9H15N3)]
method: RPBEPBE
basis: SDD
operation: Freq
keyword: #pfreq=noraman
keyword: PBEPBE/SDD
title: #p freq=noraman PBEPBE/SDD
converged: YES YES NO NO
title: Mulliken charges:
elementType: N N N C C C C C C C C C H H H H H H H H H H H H H H H
charge: -0.029975 -0.029418 -0.046998 -0.041370 -0.492977 -0.690546 -0.690240 0.039445 0.037076 0.037711 -0.750265 -0.750632 0.208072 0.222297 0.222693 0.219128 0.218716 0.206080 0.205782 0.220367 0.217894 0.242149 0.248537 0.242895 0.241701 0.242875 0.249002
chargesum: 0.00000
title: Mulliken charges with hydrogens summed into heavy atoms:
elementType: N N N C C C C C C C C C
charge: -0.029975 -0.029418 -0.046998 0.166702 -0.047987 -0.046622 -0.046197 0.039445 0.037076 0.037711 -0.016684 -0.017054
polarizability: 1.35535343e+02 -6.26596632e-02 1.29648754e+02 8.18784018e+00 1.39636835e-01 8.46699041e+01
1716.lowfreq: 0.0006 0.0007 0.0008 8.8503 10.2387 12.9078 22.3572 37.1546 42.3492
frequency: 17.4074 36.9742 42.3320 68.5155 81.6937 171.8874 177.3237 192.7598 214.5730 222.4308 243.5166 283.3863 362.2564 367.1374 455.9400 471.6430 547.5903 550.5759 579.1896 586.8378 702.3489 776.7165 829.9333 870.1043 901.7854 920.7035 920.8859 951.9958 957.0540 972.1012 1023.4978 1031.2743 1043.9690 1059.7070 1088.7609 1103.9965 1168.2561 1184.1819 1234.7161 1259.5002 1304.5458 1323.8020 1344.6499 1346.5086 1381.7111 1385.0655 1392.9886 1401.5664 1414.9016 1437.5372 1448.4974 1455.3428 1456.2437 1457.9625 1461.5531 1469.3600 1478.9909 1482.0434 1485.3696 1489.2538 2968.3763 2977.2581 2980.5620 2997.5370 2998.5640 3011.3214 3070.4236 3075.6781 3076.2695 3079.8329 3081.0245 3081.3486 3082.3706 3134.1474 3134.7677
redmass: 2.8295 1.0245 1.0226 2.4817 4.2714 5.6579 4.0346 1.1475 2.6085 1.2368 2.8291 2.4792 2.1489 1.9281 2.9065 2.4061 5.3548 6.1814 3.1125 4.1643 3.4804 3.1768 4.8828 1.8652 2.5880 8.2773 1.3170 1.7244 2.0989 2.1772 2.1175 1.9058 1.7137 1.6653 2.0808 1.5676 3.3236 2.1082 1.4094 1.4838 2.6530 1.8487 2.4444 1.7921 1.4328 1.2128 1.3222 1.2192 2.1680 1.4832 1.4243 1.0607 1.1540 1.3262 1.0443 1.0659 1.1150 1.1494 1.9951 2.4586 1.0821 1.0352 1.0367 1.0387 1.0379 1.0595 1.1002 1.1001 1.1002 1.0963 1.0950 1.1028 1.0988 1.1005 1.1001
irintensity: 0.0040 0.3482 1.1139 0.2484 0.5581 0.0891 1.5808 0.1430 2.7308 0.2645 1.0693 4.5147 0.1591 0.9706 0.1544 0.0000 12.2425 10.4985 0.1455 0.7066 3.1168 1.0396 1.2477 0.0221 1.2069 0.2299 2.7048 0.0554 1.7027 0.2520 3.6769 0.1597 18.1202 0.6232 0.1242 2.4211 0.0416 16.7596 8.6441 67.1111 22.3719 0.0168 18.6080 2.4908 8.7983 22.3643 71.1956 14.4824 1.3502 174.3548 66.5811 10.7914 68.1419 107.5989 1.5421 0.1800 0.0920 35.7569 166.2599 160.8664 30.1708 30.2544 23.1303 4.4211 3.7060 24.9207 0.2909 49.3609 50.8046 7.5128 10.8620 27.4490 64.7830 4.4355 15.9460
temp: 298.150 k
press: 1.00000 atm
elementType: 7 7 7 6 6 6 6 6 6 6 6 6 1 1 1 1 1 1 1 1 1 1 1 1 1 1 1
symmnumber: 1
zpe: 597192.8 jmol-1
zpe.correction: 0.227459 hartree
zpe.thermalcorrener: 0.241161 hartree
zpe.thermalcorrenthalpy: 0.242105 hartree
zpe.thermalcorrgfe: 0.184981 hartree
zpe.sumelectzpe: -515.292157 hartree
zpe.sumelectthermal: -515.278455 hartree
zpe.sumelectthermalent: -515.277511 hartree
zpe.sumelectthermalfe: -515.334634 hartree
dipole: 0.3760 -0.0044 -0.0338
dipole: 0.3776
quadrupole: -71.3224 -71.4847 -72.7305
quadrupole: -0.0434 0.0162 0.0611
quadrupole: 0.5235 0.3612 -0.8846 -0.0434 0.0162 0.0611
hfenergy: -515.5196159 hartree
pointgroup: C01 [X(C9H15N3)]
dipole: 0.147898 0.004125 0.0132329 debye
polarizability: 135.5190837|0.2511143|129.6473984|-8.2252903|0.4831293|84.6875189 unknown
InChI: InChI=1S/C9H15N3/c1-6(2)5-9-11-7(3)10-8(4)12-9/h6H,5H2,1-4H3
charge 0 multiplicity 1
27 atoms
N  -0.281707 -1.21734 -0.426398
N  -0.330033 1.205625 -0.406299
N  -2.263705 -0.051285 0.346723
C  2.816346 0.04909 -0.067929
C  1.707356 0.04088 -1.180663
C  2.74386 1.311638 0.821426
C  2.802836 -1.242626 0.781356
C  0.29818 0.008199 -0.648642
C  -1.559303 -1.19743 0.071376
C  -1.605473 1.126378 0.091275
C  -2.233937 -2.519216 0.317304
C  -2.327708 2.416449 0.368581
H  3.7767 0.080036 -0.624152
H  1.857991 -0.850576 -1.815345
H  1.823384 0.951946 -1.794408
H  1.81561 1.328838 1.420799
H  2.761561 2.235236 0.214943
H  3.600646 1.337681 1.520313
H  3.653639 -1.245553 1.488063
H  1.871286 -1.32762 1.369557
H  2.875268 -2.144563 0.146893
H  -1.568688 -3.188961 0.888876
H  -3.180999 -2.369774 0.855982
H  -2.441507 -3.022303 -0.645437
H  -1.735794 3.045015 1.057371
H  -2.444872 2.994872 -0.565732
H  -3.317336 2.213363 0.802768
