program: Gaussian 09
title: 000035153
version: EM64L-G09RevD.01
frameworkgroup: C1[X(C6H8BrN3)]
method: RPBEPBE
basis: SDD
operation: Freq
keyword: #p
keyword: freq=noraman
keyword: PBEPBE/SDD
title: #p freq=noraman PBEPBE/SDD
converged: NO YES NO NO
title: Mulliken charges:
elementType: Br N N N C C C C C C H H H H H H H H
charge: -0.003602 -0.016768 -0.016168 -0.034386 0.116475 0.063352 0.063599 -0.780184 -0.743776 -0.743821 0.302331 0.302361 0.251371 0.249276 0.244655 0.251166 0.244642 0.249477
chargesum: 0.00000
title: Mulliken charges with hydrogens summed into heavy atoms:
elementType: Br N N N C C C C C C
charge: -0.003602 -0.016768 -0.016168 -0.034386 0.116475 0.063352 0.063599 -0.175492 0.001526 0.001465
polarizability: 1.28231887e+02 -3.59767735e-02 1.01937812e+02 1.32061162e+00 1.77262441e-02 6.98554951e+01
1716.lowfreq: -49.8144 -35.6058 -4.7126 -0.0005 -0.0004 0.0004 4.1540 7.0257 38.3248
frequency: -49.7237 -35.5269 38.3116 71.9360 168.3054 172.8304 202.5882 269.6332 285.5204 461.8645 502.3045 545.1936 562.2641 580.2427 622.6038 679.4656 827.2200 857.7347 913.5768 919.6977 960.5947 1029.3941 1038.4281 1047.1137 1057.4867 1104.8554 1188.3587 1230.1076 1320.3764 1337.0659 1375.3467 1394.5620 1407.5184 1430.1062 1442.4794 1443.5153 1455.7013 1457.8052 1482.3407 1488.6479 2994.6837 2994.8658 3086.5313 3086.6396 3086.9280 3137.6482 3137.9988 3186.2245
redmass: 1.0173 1.0152 4.7196 9.4917 6.0858 4.1309 8.6257 2.2131 2.5370 2.5772 6.6761 5.5327 6.2751 3.2819 4.5513 4.2242 5.8971 1.8252 2.7091 11.2326 2.6590 2.1793 2.0917 1.8250 1.6865 1.4683 2.7014 1.1609 5.0748 4.1826 1.5901 1.3044 1.5884 1.5148 1.2824 1.6451 1.0900 1.2581 2.0993 3.6007 1.0421 1.0421 1.0571 1.0885 1.0890 1.1024 1.1024 1.1129
irintensity: 0.3554 0.7947 0.3136 0.9899 0.0097 2.9997 1.7585 5.6714 2.5462 0.0056 8.5484 9.2723 24.6655 1.2311 13.5062 2.5486 1.2460 0.0128 0.2574 0.2737 2.9663 1.5731 5.3524 17.3683 4.8026 4.3263 1.3170 11.4237 4.6077 21.7297 2.3751 65.2864 6.9015 66.2136 92.3209 191.3214 40.9556 43.6222 106.3841 225.8841 2.0289 2.2169 3.6342 6.5051 15.3617 2.0744 9.0153 0.0665
temp: 298.150 k
press: 1.00000 atm
elementType: 35 7 7 7 6 6 6 6 6 6 1 1 1 1 1 1 1 1
symmnumber: 1
zpe: 353404.5 jmol-1
zpe.correction: 0.134605 hartree
zpe.thermalcorrener: 0.143594 hartree
zpe.thermalcorrenthalpy: 0.144538 hartree
zpe.thermalcorrgfe: 0.098103 hartree
zpe.sumelectzpe: -410.408940 hartree
zpe.sumelectthermal: -410.399951 hartree
zpe.sumelectthermalent: -410.399007 hartree
zpe.sumelectthermalfe: -410.445442 hartree
dipole: 2.1741 0.0040 1.2145
dipole: 2.4903
quadrupole: -69.4268 -65.4550 -65.2106
quadrupole: -0.0071 -1.0717 0.0027
quadrupole: -2.7293 1.2425 1.4868 -0.0071 -1.0717 0.0027
hfenergy: -410.5435447 hartree
pointgroup: C01 [X(C6H8Br1N3)]
dipole: -0.781936 0.001428 -0.5903403 debye
dipolederiv: -0.443771 0.0001128 -0.0985406 -0.0000248 -0.1013646 0.0000283 -0.2450596 0.0000759 -0.2618967 -0.9681418 -0.3107032 0.0644433 -0.2707437 -0.6394382 -0.0010946 0.1747257 0.0584113 -0.1586098 -0.9683733 0.3121734 0.0641893 0.2705606 -0.6396501 0.001157 0.1741268 -0.0586036 -0.1590096 -0.4879044 0.000145 0.0325432 -0.0007131 -1.1143735 0.0002074 0.0520556 -0.0002864 -0.1918607 1.0263177 0.0000805 0.027264 0.001084 0.5606904 -0.0001965 -0.1073255 -0.0002658 -0.0280077 0.7525091 0.3380866 -0.0687669 0.3530756 1.0327091 -0.0028353 -0.0899124 0.004806 0.1273981 0.7497451 -0.336411 -0.0685331 -0.3523092 1.0342221 0.0026886 -0.0897363 -0.004692 0.1270639 0.2198408 -0.0001048 0.1921478 -0.0000743 0.0892596 -0.0001423 0.2449519 -0.0000124 0.3841793 -0.1132052 -0.2305069 -0.0077863 -0.2132728 -0.3185709 0.0103269 -0.0709549 -0.1047423 -0.0023562 -0.1031344 0.2175246 -0.0094095 0.215445 -0.3280092 -0.0107142 -0.072543 0.1066065 -0.002106 0.0374321 0.0139169 -0.0590451 -0.0498979 0.0293668 0.0711885 -0.0377394 0.0584819 -0.0144749 0.0374426 -0.0138638 -0.0590236 0.0499176 0.0294525 -0.0711523 -0.0377063 -0.0584528 -0.0144841 0.0212417 0.0971541 -0.0472722 0.0450008 0.0204886 0.0476939 -0.0056998 0.080563 0.1026495 0.016633 0.0067415 0.095747 0.0355329 0.0806984 -0.036704 0.115167 0.030895 0.0421439 0.0957781 -0.039318 -0.0537435 -0.0384847 0.0787304 -0.0210688 -0.057514 -0.0272632 -0.0476265 0.0210182 -0.0916737 -0.051222 -0.0442133 0.0242138 -0.0506194 -0.0082213 -0.0853421 0.0990791 0.0976458 0.0415238 -0.04742 0.0381931 0.0793467 0.0249833 -0.0522293 0.0303824 -0.0501127 0.0089261 -0.0048781 0.0944284 -0.0390757 0.0822281 0.0362535 0.1136147 -0.0305616 0.0480311 unknown
polarizability: 126.7816909|0.0414274|101.9378165|9.1813765|-0.0151645|71.3056866 unknown
InChI: InChI=1S/C6H8BrN3/c1-4-8-5(2)10-6(3-7)9-4/h3H2,1-2H3
charge 0 multiplicity 1
18 atoms
Br 3.474218 0.000142 0.982646
N  0.309293 -1.215576 -0.266245
N  0.30879 1.215315 -0.266581
N  -1.728517 -0.000418 0.234041
C  0.923891 0.000139 -0.403393
C  -1.025576 -1.165905 0.053936
C  -1.026266 1.165122 0.053775
C  2.385579 0.000305 -0.73811
C  -1.763049 -2.466057 0.202767
C  -1.763294 2.465539 0.202586
H  2.683775 0.919034 -1.258645
H  2.683899 -0.918261 -1.258866
H  -1.079284 -3.258582 0.543739
H  -2.609417 -2.349202 0.896694
H  -2.173758 -2.777689 -0.777089
H  -1.086883 3.249779 0.57648
H  -2.141881 2.796311 -0.783888
H  -2.629621 2.340605 0.869652
