program: Gaussian 09
title: 000035163
version: EM64L-G09RevD.01
frameworkgroup: C1[X(C11H10ClN3)]
method: RPBEPBE
basis: SDD
operation: Freq
keyword: #p
keyword: freq=noraman
keyword: PBEPBE/SDD
title: #p freq=noraman PBEPBE/SDD
converged: NO YES NO NO
title: Mulliken charges:
elementType: Cl N N N C C C C C C C C C C C H H H H H H H H H H
charge: -0.048846 -0.058675 -0.060377 -0.029502 0.310349 -0.047458 -0.340690 -0.340575 0.038685 0.036208 -0.214232 -0.214016 -0.099049 -0.745797 -0.745708 0.284080 0.284211 0.258623 0.258629 0.245771 0.244809 0.246457 0.244754 0.247056 0.245292
chargesum: 0.00000
title: Mulliken charges with hydrogens summed into heavy atoms:
elementType: Cl N N N C C C C C C C C C C C
charge: -0.048846 -0.058675 -0.060377 -0.029502 0.310349 -0.047458 -0.056609 -0.056363 0.038685 0.036208 0.044391 0.044613 -0.099049 -0.008760 -0.008606
polarizability: 2.65613837e+02 -1.49179679e-01 1.51073502e+02 6.39423690e-01 2.29940686e-01 6.68393766e+01
1716.lowfreq: -45.0962 -5.8924 -4.3534 -0.0016 0.0005 0.0021 2.5443 35.8003 47.1007
frequency: -45.0715 35.7851 47.1006 53.0130 93.7716 142.9877 169.5481 175.3242 227.2340 248.6022 297.3019 298.9997 355.7379 410.5160 466.3004 478.5053 505.1642 559.0645 573.0536 580.9296 624.5758 642.3164 697.7506 727.7279 812.9891 840.6559 844.8538 863.2462 920.6463 944.0959 973.7968 988.7509 993.6000 1000.5688 1033.9110 1047.2197 1054.8219 1068.2726 1101.6012 1129.3726 1169.5888 1176.1014 1284.0914 1308.7020 1331.7433 1380.2816 1381.2203 1392.1962 1397.8483 1417.7543 1433.5054 1448.1722 1455.0332 1458.6187 1473.5953 1486.1411 1490.1259 1580.0892 1598.8105 2995.8914 2998.6324 3082.7744 3085.7623 3133.6128 3134.2030 3161.5037 3161.6608 3177.7564 3181.6331
redmass: 1.0145 1.0295 3.6043 8.2089 5.6538 10.2721 3.5727 6.1321 5.3113 6.3172 5.9590 3.5428 3.4856 2.9443 9.0398 3.2868 3.7623 5.9194 4.8150 3.3710 7.1637 3.8385 7.0975 3.7105 2.7835 1.2464 5.2299 2.0805 13.5089 4.3410 1.8580 1.3672 1.3545 3.6923 2.1253 1.7047 1.6616 2.7900 1.3399 3.2002 5.0800 1.1645 1.4135 3.4764 4.4957 1.4674 4.2582 1.4893 3.5410 2.6443 1.7439 1.2950 1.0805 1.0894 3.7371 3.3642 2.1523 8.1666 6.3454 1.0406 1.0386 1.0951 1.0916 1.1017 1.1008 1.0886 1.0886 1.0965 1.0978
irintensity: 0.3992 0.7359 0.0033 0.0033 0.0410 0.5170 3.9496 0.0311 2.3781 2.2680 0.5013 0.7459 0.1226 0.0000 34.6631 16.8429 1.8098 9.2324 4.8483 1.1891 1.6464 8.5296 10.3197 2.7943 42.9875 0.0000 16.5721 29.4139 4.0258 2.5341 9.0285 1.5504 0.0002 49.9251 0.7398 19.4505 2.7935 56.8094 9.2733 2.8558 0.9415 27.9910 2.1743 4.9569 79.7511 76.9203 4.2253 53.9798 2.9476 7.2886 614.0302 63.1619 34.7259 31.2507 250.3668 0.5290 311.3981 7.8105 100.2101 3.5737 3.8890 8.7311 11.7846 8.8786 7.0405 0.1760 0.1855 2.8622 5.4322
temp: 298.150 k
press: 1.00000 atm
elementType: 17 7 7 7 6 6 6 6 6 6 6 6 6 6 6 1 1 1 1 1 1 1 1 1 1
symmnumber: 1
zpe: 489313.1 jmol-1
zpe.correction: 0.186370 hartree
zpe.thermalcorrener: 0.199441 hartree
zpe.thermalcorrenthalpy: 0.200385 hartree
zpe.thermalcorrgfe: 0.144828 hartree
zpe.sumelectzpe: -1048.439502 hartree
zpe.sumelectthermal: -1048.426431 hartree
zpe.sumelectthermalent: -1048.425486 hartree
zpe.sumelectthermalfe: -1048.481043 hartree
dipole: 1.6944 0.0168 0.1132
dipole: 1.6983
quadrupole: -98.4926 -84.1270 -95.8716
quadrupole: -0.0078 0.4389 0.0760
quadrupole: -5.6622 8.7034 -3.0412 -0.0078 0.4389 0.0760
hfenergy: -1048.6258715 hartree
pointgroup: C01 [X(C11H10Cl1N3)]
dipole: -0.6667106 -0.0071326 0.043434 debye
dipolederiv: -1.0891424 -0.000043 -0.0014264 0.000221 -0.121601 -0.0010253 -0.0027269 -0.0010125 -0.0662356 -1.4512608 -0.2816569 0.0053941 -0.5555408 -0.6196942 -0.00964 -0.0165149 -0.0059862 -0.1625883 -1.4459735 0.273719 0.0108173 0.5541413 -0.6177101 -0.0058661 0.0026301 -0.01142 -0.1612784 -0.7134787 -0.0007132 -0.0097315 0.0044282 -1.1232559 -0.0119631 -0.0003498 -0.0164371 -0.1802436 -0.8220723 -0.0005062 0.0006892 0.0012043 -0.07479 -0.0007171 -0.0035195 -0.0015743 -0.0446426 2.1103337 0.0005838 -0.0032053 -0.003847 0.4917787 0.0057923 0.0221176 0.0098812 0.1227718 0.2326034 0.0919958 0.0020411 -0.2639637 0.0174146 0.002004 -0.0033666 0.0029982 -0.1043368 0.2328435 -0.0919997 -0.0015268 0.2637591 0.0177157 0.0025104 0.0061006 0.0021592 -0.1043932 1.1019898 0.308351 -0.0098042 0.4054916 1.0157408 -0.0087414 -0.0395101 -0.0484156 0.0905928 1.1123867 -0.3139003 -0.0131658 -0.4045357 1.0072372 0.0264506 -0.0279489 0.0558377 0.0942281 -0.5201075 -0.1563303 -0.0033673 -0.2669021 -0.0180488 0.0013243 -0.0056265 0.001025 -0.1111585 -0.5194028 0.1563393 0.0024781 0.267056 -0.0180272 0.002001 0.0039035 0.0020916 -0.1111689 1.5103025 -0.0001276 0.0028957 0.0003412 0.2195272 0.0051928 0.0039395 0.0051794 -0.0552763 -0.1517536 -0.2440561 0.0094915 -0.2313957 -0.2706659 0.0199189 0.0993469 0.1246189 -0.010986 -0.2034917 0.2996457 0.0118328 0.2135124 -0.2273213 -0.0160809 0.0566843 -0.0703774 -0.0144002 0.1281096 -0.0655105 -0.0018025 -0.0476478 0.0263721 -0.0021941 -0.0012209 -0.0027354 0.1498006 0.1287272 0.0653531 0.0007396 0.0478063 0.0264526 -0.0024668 0.0008176 -0.0021111 0.1499894 0.0345577 0.0649849 0.0009074 0.069196 -0.0000835 -0.002942 0.0009079 -0.002831 0.1649219 0.0345758 -0.0649913 -0.0014387 -0.0692471 -0.0000543 -0.0031521 -0.0015044 -0.0032227 0.164933 0.0387533 0.1086272 0.0552436 0.0397579 0.0017859 -0.0492153 0.0111632 -0.0812038 0.0963055 0.1029983 -0.0231598 0.0422082 -0.0386598 0.070027 0.0156529 0.0480531 0.0320545 -0.0630895 -0.0127592 0.0005678 -0.0968021 0.0323202 0.0755933 0.0309158 -0.1210325 -0.0309359 0.0603467 0.0872507 0.0077952 0.079163 0.0274043 0.068233 0.0114307 0.0885648 -0.0200375 -0.0402644 0.0389774 -0.134612 0.0218237 -0.043894 -0.015666 0.0187666 0.0030154 0.0340263 0.1176471 0.0350328 -0.0003557 -0.1034547 -0.0010062 0.06904 -0.0279561 -0.1239236 0.0284285 0.0185254 unknown
polarizability: 265.6151713|-0.182374|151.0563607|-0.3505225|1.2273403|66.8551843 unknown
InChI: InChI=1S/C11H10ClN3/c1-7-13-8(2)15-11(14-7)9-3-5-10(12)6-4-9/h3-6H,1-2H3
charge 0 multiplicity 1
25 atoms
Cl 5.468415 -0.001042 0.007603
N  -1.290632 -1.211817 -0.034757
N  -1.289622 1.214708 0.011435
N  -3.387036 0.002021 -0.017443
C  0.838829 0.000002 -0.00453
C  -0.641983 0.000263 -0.007997
C  1.554512 -1.227303 -0.025539
C  1.554924 1.226965 0.020414
C  -2.658415 -1.160624 -0.036642
C  -2.656194 1.164941 0.007864
C  2.963426 -1.234528 -0.021768
C  2.963875 1.233572 0.02409
C  3.645632 -0.000612 0.002899
C  -3.41632 -2.459539 -0.041651
C  -3.41796 2.461149 0.040602
H  0.989095 -2.163311 -0.044861
H  0.989823 2.16319 0.036845
H  3.52113 -2.174948 -0.037532
H  3.521868 2.173763 0.042826
H  -2.781377 -3.274362 -0.420811
H  -3.727397 -2.715389 0.989203
H  -4.333268 -2.366312 -0.645375
H  -3.936196 2.569264 1.011445
H  -2.734781 3.311589 -0.098713
H  -4.198347 2.465661 -0.73941
